Linking compilation error

Bugs item #2702932, was opened at 2009-03-22 12:16
Message generated for change (Tracker Item Submitted) made by anubisg1
You can respond by visiting:

Please note that this message will contain a full copy of the comment thread,
including the initial issue submission, for this request,
not just the latest update.
Category: Building / Install
Group: None
Status: Open
Resolution: None
Priority: 5
Private: No
Submitted By: Andrea Florio (anubisg1)
Assigned to: Nobody/Anonymous (nobody)
Summary: linking compilation error

Initial Comment:
Linking CXX shared library …/…/lib/
/usr/lib/python2.6/config/libpython2.6.a(posixmodule.o): In function posix_forkpty': /usr/src/packages/BUILD/Python-2.6/./Modules/posixmodule.c:3726: undefined reference toforkpty’
/usr/lib/python2.6/config/libpython2.6.a(posixmodule.o): In function posix_openpty': /usr/src/packages/BUILD/Python-2.6/./Modules/posixmodule.c:3667: undefined reference toopenpty’
collect2: ld returned 1 exit status
make[2]: *** [lib/] Error 1
make[1]: *** [libavogadro/src/CMakeFiles/avogadro-lib.dir/all] Error 2
make: *** [all] Error 2

any idea?

You can respond by visiting: