Compilation issue on RHEL5

Dear All,

I’m having troubles in compiling avogadro 1.0
on Redhat Enterprise Linux 5 Server.

I’ve basically followed the “Compiling on Linux
Instruction” section and finally issued the following
commands:

tar jxvf avogadro-1.0.0.tar.bz2
cd avogadro-1.0.0
mkdir build
cd build
cmake
-DOPENBABEL2_INCLUDE_DIR=/software/openbabel-2.2.3/include/openbabel-2.0/openbabel

-DOPENBABEL2_LIBRARIES=/software/openbabel-2.2.3/lib/libopenbabel.so
-DOPENBABEL2_VERSION_MET=true
-DEIGEN2_INCLUDE_DIR=/software/eigen-2.0.12/include/eigen2
-DCMAKE_INSTALL_PREFIX=/software/avogadro-1.0.0
…/
make

Here I post the error messages that I get when I run make… and the
question is:

What do I still miss or what is missconfigured in my installation procedure?

Best,
MG.

#############
[software@lcbcpc09 build]$ make
[ 1%] Generating qrc_pythontool.cxx
[ 1%] Generating pythonextension_p.moc
[ 1%] Generating tool.moc
[ 2%] Generating cube.moc
[ 2%] Generating plugin.moc
[ 2%] Generating primitive.moc
[ 2%] Generating elementtranslator.moc
[ 2%] Generating colorbutton.moc
[ 3%] Generating fragment.moc
[ 3%] Generating periodictableview.moc
[ 3%] Generating elementdetail_p.moc
/software/BUILD/avogadro-1.0.0/libavogadro/src/elementdetail_p.h:87:
Warning: Class ElementDetail implements the interface QGraphicsItem but
does not list it in Q_INTERFACES. qobject_cast to QGraphicsItem will not
work!
[ 3%] Generating engine.moc
[ 3%] Generating color.moc
/software/BUILD/avogadro-1.0.0/libavogadro/src/color.h:244: Warning:
Signals cannot be declared virtual
[ 3%] Generating plotwidget.moc
[ 4%] Generating pythonerror.moc
[ 4%] Generating toolgroup.moc
[ 4%] Generating periodictablescene_p.moc
[ 4%] Generating mesh.moc
[ 4%] Generating pythonengine_p.moc
[ 4%] Generating extension.moc
[ 5%] Generating animation.moc
[ 5%] Generating atom.moc
[ 5%] Generating zmatrix.moc
[ 5%] Generating bond.moc
[ 5%] Generating molecule.moc
[ 5%] Generating glwidget.moc
[ 6%] Generating residue.moc
[ 6%] Generating pythontool_p.moc
[ 6%] Generating pluginmanager.moc
[ 6%] Generating protein.moc
[ 6%] Generating moleculefile.moc
[ 6%] Generating bsdyengine.moc
[ 7%] Generating ui_bsdysettingswidget.h
[ 7%] Generating elementcolor.moc
[ 7%] Generating libavogadro_cs.qm
Scanning directory
’/software/BUILD/avogadro-1.0.0/libavogadro/src’…/software/BUILD/avogadro-1.0.0/libavogadro/src/moleculefile.cpp:723:
Class ‘Avogadro::ReadFileThread’ lacks Q_OBJECT macro

[ 7%] Generating libavogadro_pt_BR.qm
Scanning directory
’/software/BUILD/avogadro-1.0.0/libavogadro/src’…/software/BUILD/avogadro-1.0.0/libavogadro/src/moleculefile.cpp:723:
Class ‘Avogadro::ReadFileThread’ lacks Q_OBJECT macro

[ 7%] Generating libavogadro_el.qm
Scanning directory
’/software/BUILD/avogadro-1.0.0/libavogadro/src’…/software/BUILD/avogadro-1.0.0/libavogadro/src/moleculefile.cpp:723:
Class ‘Avogadro::ReadFileThread’ lacks Q_OBJECT macro

[ 7%] Generating libavogadro_pl.qm
Scanning directory
’/software/BUILD/avogadro-1.0.0/libavogadro/src’…/software/BUILD/avogadro-1.0.0/libavogadro/src/moleculefile.cpp:723:
Class ‘Avogadro::ReadFileThread’ lacks Q_OBJECT macro

[ 8%] Generating libavogadro_tr.qm
Scanning directory
’/software/BUILD/avogadro-1.0.0/libavogadro/src’…/software/BUILD/avogadro-1.0.0/libavogadro/src/moleculefile.cpp:723:
Class ‘Avogadro::ReadFileThread’ lacks Q_OBJECT macro

[ 8%] Generating libavogadro_pt.qm
Scanning directory
’/software/BUILD/avogadro-1.0.0/libavogadro/src’…/software/BUILD/avogadro-1.0.0/libavogadro/src/moleculefile.cpp:723:
Class ‘Avogadro::ReadFileThread’ lacks Q_OBJECT macro

[ 8%] Generating libavogadro_it.qm
Scanning directory
’/software/BUILD/avogadro-1.0.0/libavogadro/src’…/software/BUILD/avogadro-1.0.0/libavogadro/src/moleculefile.cpp:723:
Class ‘Avogadro::ReadFileThread’ lacks Q_OBJECT macro

[ 8%] Generating libavogadro_nl.qm
Scanning directory
’/software/BUILD/avogadro-1.0.0/libavogadro/src’…/software/BUILD/avogadro-1.0.0/libavogadro/src/moleculefile.cpp:723:
Class ‘Avogadro::ReadFileThread’ lacks Q_OBJECT macro

[ 8%] Generating libavogadro_sv.qm
Scanning directory
’/software/BUILD/avogadro-1.0.0/libavogadro/src’…/software/BUILD/avogadro-1.0.0/libavogadro/src/moleculefile.cpp:723:
Class ‘Avogadro::ReadFileThread’ lacks Q_OBJECT macro

[ 8%] Generating libavogadro_uk.qm
Scanning directory
’/software/BUILD/avogadro-1.0.0/libavogadro/src’…/software/BUILD/avogadro-1.0.0/libavogadro/src/moleculefile.cpp:723:
Class ‘Avogadro::ReadFileThread’ lacks Q_OBJECT macro

[ 9%] Generating libavogadro_sk.qm
Scanning directory
’/software/BUILD/avogadro-1.0.0/libavogadro/src’…/software/BUILD/avogadro-1.0.0/libavogadro/src/moleculefile.cpp:723:
Class ‘Avogadro::ReadFileThread’ lacks Q_OBJECT macro

[ 9%] Generating libavogadro_id.qm
Scanning directory
’/software/BUILD/avogadro-1.0.0/libavogadro/src’…/software/BUILD/avogadro-1.0.0/libavogadro/src/moleculefile.cpp:723:
Class ‘Avogadro::ReadFileThread’ lacks Q_OBJECT macro

[ 9%] Generating libavogadro_fi.qm
Scanning directory
’/software/BUILD/avogadro-1.0.0/libavogadro/src’…/software/BUILD/avogadro-1.0.0/libavogadro/src/moleculefile.cpp:723:
Class ‘Avogadro::ReadFileThread’ lacks Q_OBJECT macro

[ 9%] Generating libavogadro_ko.qm
Scanning directory
’/software/BUILD/avogadro-1.0.0/libavogadro/src’…/software/BUILD/avogadro-1.0.0/libavogadro/src/moleculefile.cpp:723:
Class ‘Avogadro::ReadFileThread’ lacks Q_OBJECT macro

[ 9%] Generating libavogadro_en_CA.qm
Scanning directory
’/software/BUILD/avogadro-1.0.0/libavogadro/src’…/software/BUILD/avogadro-1.0.0/libavogadro/src/moleculefile.cpp:723:
Class ‘Avogadro::ReadFileThread’ lacks Q_OBJECT macro

[ 9%] Generating libavogadro_bg.qm
Scanning directory
’/software/BUILD/avogadro-1.0.0/libavogadro/src’…/software/BUILD/avogadro-1.0.0/libavogadro/src/moleculefile.cpp:723:
Class ‘Avogadro::ReadFileThread’ lacks Q_OBJECT macro

[ 10%] Generating libavogadro_es.qm
Scanning directory
’/software/BUILD/avogadro-1.0.0/libavogadro/src’…/software/BUILD/avogadro-1.0.0/libavogadro/src/moleculefile.cpp:723:
Class ‘Avogadro::ReadFileThread’ lacks Q_OBJECT macro

[ 10%] Generating libavogadro_ar.qm
Scanning directory
’/software/BUILD/avogadro-1.0.0/libavogadro/src’…/software/BUILD/avogadro-1.0.0/libavogadro/src/moleculefile.cpp:723:
Class ‘Avogadro::ReadFileThread’ lacks Q_OBJECT macro

[ 10%] Generating libavogadro_ca.qm
Scanning directory
’/software/BUILD/avogadro-1.0.0/libavogadro/src’…/software/BUILD/avogadro-1.0.0/libavogadro/src/moleculefile.cpp:723:
Class ‘Avogadro::ReadFileThread’ lacks Q_OBJECT macro

[ 10%] Generating libavogadro_zh_TW.qm
Scanning directory
’/software/BUILD/avogadro-1.0.0/libavogadro/src’…/software/BUILD/avogadro-1.0.0/libavogadro/src/moleculefile.cpp:723:
Class ‘Avogadro::ReadFileThread’ lacks Q_OBJECT macro

[ 10%] Generating libavogadro_zh_CN.qm
Scanning directory
’/software/BUILD/avogadro-1.0.0/libavogadro/src’…/software/BUILD/avogadro-1.0.0/libavogadro/src/moleculefile.cpp:723:
Class ‘Avogadro::ReadFileThread’ lacks Q_OBJECT macro

[ 11%] Generating libavogadro_en_GB.qm
Scanning directory
’/software/BUILD/avogadro-1.0.0/libavogadro/src’…/software/BUILD/avogadro-1.0.0/libavogadro/src/moleculefile.cpp:723:
Class ‘Avogadro::ReadFileThread’ lacks Q_OBJECT macro

[ 11%] Generating libavogadro_nb.qm
Scanning directory
’/software/BUILD/avogadro-1.0.0/libavogadro/src’…/software/BUILD/avogadro-1.0.0/libavogadro/src/moleculefile.cpp:723:
Class ‘Avogadro::ReadFileThread’ lacks Q_OBJECT macro

[ 11%] Generating libavogadro_fr.qm
Scanning directory
’/software/BUILD/avogadro-1.0.0/libavogadro/src’…/software/BUILD/avogadro-1.0.0/libavogadro/src/moleculefile.cpp:723:
Class ‘Avogadro::ReadFileThread’ lacks Q_OBJECT macro

[ 11%] Generating libavogadro_de.qm
Scanning directory
’/software/BUILD/avogadro-1.0.0/libavogadro/src’…/software/BUILD/avogadro-1.0.0/libavogadro/src/moleculefile.cpp:723:
Class ‘Avogadro::ReadFileThread’ lacks Q_OBJECT macro

[ 11%] Generating libavogadro_ru.qm
Scanning directory
’/software/BUILD/avogadro-1.0.0/libavogadro/src’…/software/BUILD/avogadro-1.0.0/libavogadro/src/moleculefile.cpp:723:
Class ‘Avogadro::ReadFileThread’ lacks Q_OBJECT macro

[ 11%] Generating libavogadro_ja.qm
Scanning directory
’/software/BUILD/avogadro-1.0.0/libavogadro/src’…/software/BUILD/avogadro-1.0.0/libavogadro/src/moleculefile.cpp:723:
Class ‘Avogadro::ReadFileThread’ lacks Q_OBJECT macro

[ 11%] Building CXX object
libavogadro/src/CMakeFiles/avogadro.dir/pythonextension_p.cpp.o
/usr/lib/gcc/x86_64-redhat-linux/4.1.2/…/…/…/…/include/c++/4.1.2/bits/localefwd.h:124:
error: ‘mbstate_t’ was not declared in this scope
/usr/lib/gcc/x86_64-redhat-linux/4.1.2/…/…/…/…/include/c++/4.1.2/bits/localefwd.h:124:
error: template argument 3 is invalid
/usr/lib/gcc/x86_64-redhat-linux/4.1.2/…/…/…/…/include/c++/4.1.2/bits/localefwd.h:126:
error: ‘mbstate_t’ was not declared in this scope
/usr/lib/gcc/x86_64-redhat-linux/4.1.2/…/…/…/…/include/c++/4.1.2/bits/localefwd.h:126:
error: template argument 3 is invalid
/usr/lib/gcc/x86_64-redhat-linux/4.1.2/…/…/…/…/include/c++/4.1.2/bits/localefwd.h:133:
error: expected type-specifier before ‘istreambuf_iterator’
/usr/lib/gcc/x86_64-redhat-linux/4.1.2/…/…/…/…/include/c++/4.1.2/bits/localefwd.h:133:
error: expected >' before ‘istreambuf_iterator’ /usr/lib/gcc/x86_64-redhat-linux/4.1.2/../../../../include/c++/4.1.2/bits/localefwd.h:133: error: expected unqualified-id before ‘>’ token /usr/lib/gcc/x86_64-redhat-linux/4.1.2/../../../../include/c++/4.1.2/bits/localefwd.h:135: error: expected type-specifier before ‘ostreambuf_iterator’ /usr/lib/gcc/x86_64-redhat-linux/4.1.2/../../../../include/c++/4.1.2/bits/localefwd.h:135: error: expected>’ before ‘ostreambuf_iterator’
/usr/lib/gcc/x86_64-redhat-linux/4.1.2/…/…/…/…/include/c++/4.1.2/bits/localefwd.h:135:
error: expected unqualified-id before ‘>’ token
/usr/lib/gcc/x86_64-redhat-linux/4.1.2/…/…/…/…/include/c++/4.1.2/bits/localefwd.h:149:
error: expected type-specifier before ‘istreambuf_iterator’
/usr/lib/gcc/x86_64-redhat-linux/4.1.2/…/…/…/…/include/c++/4.1.2/bits/localefwd.h:149:
error: expected >' before ‘istreambuf_iterator’ /usr/lib/gcc/x86_64-redhat-linux/4.1.2/../../../../include/c++/4.1.2/bits/localefwd.h:149: error: expected unqualified-id before ‘>’ token /usr/lib/gcc/x86_64-redhat-linux/4.1.2/../../../../include/c++/4.1.2/bits/localefwd.h:151: error: expected type-specifier before ‘istreambuf_iterator’ /usr/lib/gcc/x86_64-redhat-linux/4.1.2/../../../../include/c++/4.1.2/bits/localefwd.h:151: error: expected>’ before ‘istreambuf_iterator’
/usr/lib/gcc/x86_64-redhat-linux/4.1.2/…/…/…/…/include/c++/4.1.2/bits/localefwd.h:151:
error: expected unqualified-id before ‘>’ token
/usr/lib/gcc/x86_64-redhat-linux/4.1.2/…/…/…/…/include/c++/4.1.2/bits/localefwd.h:153:
error: expected type-specifier before ‘ostreambuf_iterator’
/usr/lib/gcc/x86_64-redhat-linux/4.1.2/…/…/…/…/include/c++/4.1.2/bits/localefwd.h:153:
error: expected >' before ‘ostreambuf_iterator’ /usr/lib/gcc/x86_64-redhat-linux/4.1.2/../../../../include/c++/4.1.2/bits/localefwd.h:153: error: expected unqualified-id before ‘>’ token /usr/lib/gcc/x86_64-redhat-linux/4.1.2/../../../../include/c++/4.1.2/bits/localefwd.h:155: error: expected type-specifier before ‘ostreambuf_iterator’ /usr/lib/gcc/x86_64-redhat-linux/4.1.2/../../../../include/c++/4.1.2/bits/localefwd.h:155: error: expected>’ before ‘ostreambuf_iterator’
/usr/lib/gcc/x86_64-redhat-linux/4.1.2/…/…/…/…/include/c++/4.1.2/bits/localefwd.h:155:
error: expected unqualified-id before ‘>’ token
/usr/lib/gcc/x86_64-redhat-linux/4.1.2/…/…/…/…/include/c++/4.1.2/bits/localefwd.h:161:
error: expected type-specifier before ‘istreambuf_iterator’
/usr/lib/gcc/x86_64-redhat-linux/4.1.2/…/…/…/…/include/c++/4.1.2/bits/localefwd.h:161:
error: expected >' before ‘istreambuf_iterator’ /usr/lib/gcc/x86_64-redhat-linux/4.1.2/../../../../include/c++/4.1.2/bits/localefwd.h:161: error: expected unqualified-id before ‘>’ token /usr/lib/gcc/x86_64-redhat-linux/4.1.2/../../../../include/c++/4.1.2/bits/localefwd.h:163: error: expected type-specifier before ‘ostreambuf_iterator’ /usr/lib/gcc/x86_64-redhat-linux/4.1.2/../../../../include/c++/4.1.2/bits/localefwd.h:163: error: expected>’ before ‘ostreambuf_iterator’
/usr/lib/gcc/x86_64-redhat-linux/4.1.2/…/…/…/…/include/c++/4.1.2/bits/localefwd.h:163:
error: expected unqualified-id before ‘>’ token
/usr/lib/gcc/x86_64-redhat-linux/4.1.2/…/…/…/…/include/c++/4.1.2/bits/locale_classes.h:310:
error: ‘_GLIBCXX_NUM_CATEGORIES’ was not declared in this scope
/usr/lib/gcc/x86_64-redhat-linux/4.1.2/…/…/…/…/include/c++/4.1.2/bits/locale_classes.h:352:
error: ‘__c_locale’ does not name a type
/usr/lib/gcc/x86_64-redhat-linux/4.1.2/…/…/…/…/include/c++/4.1.2/bits/locale_classes.h:383:
error: ‘__c_locale’ has not been declared
/usr/lib/gcc/x86_64-redhat-linux/4.1.2/…/…/…/…/include/c++/4.1.2/bits/locale_classes.h:384:
error: ‘__c_locale’ has not been declared
/usr/lib/gcc/x86_64-redhat-linux/4.1.2/…/…/…/…/include/c++/4.1.2/bits/locale_classes.h:386:
error: ‘__c_locale’ does not name a type
/usr/lib/gcc/x86_64-redhat-linux/4.1.2/…/…/…/…/include/c++/4.1.2/bits/locale_classes.h:390:
error: ‘__c_locale’ has not been declared
/usr/lib/gcc/x86_64-redhat-linux/4.1.2/…/…/…/…/include/c++/4.1.2/bits/locale_classes.h:394:
error: ‘__c_locale’ does not name a type
/usr/lib/gcc/x86_64-redhat-linux/4.1.2/…/…/…/…/include/c++/4.1.2/bits/ios_base.h:208:
error: expected class-name before ‘{’ token
/usr/lib/gcc/x86_64-redhat-linux/4.1.2/…/…/…/…/include/c++/4.1.2/bits/ios_base.h:224:
error: field ‘_M_msg’ has incomplete type
/usr/lib/gcc/x86_64-redhat-linux/4.1.2/…/…/…/…/include/c++/4.1.2/bits/ios_base.h:408:
error: ‘streampos’ in namespace ‘std’ does not name a type
/usr/lib/gcc/x86_64-redhat-linux/4.1.2/…/…/…/…/include/c++/4.1.2/bits/ios_base.h:409:
error: ‘streamoff’ in namespace ‘std’ does not name a type
/usr/lib/gcc/x86_64-redhat-linux/4.1.2/…/…/…/…/include/c++/4.1.2/bits/ios_base.h:457:
error: ‘streamsize’ does not name a type
/usr/lib/gcc/x86_64-redhat-linux/4.1.2/…/…/…/…/include/c++/4.1.2/bits/ios_base.h:458:
error: ‘streamsize’ does not name a type
/usr/lib/gcc/x86_64-redhat-linux/4.1.2/…/…/…/…/include/c++/4.1.2/bits/ios_base.h:617:
error: ‘streamsize’ does not name a type
/usr/lib/gcc/x86_64-redhat-linux/4.1.2/…/…/…/…/include/c++/4.1.2/bits/ios_base.h:625:
error: ‘streamsize’ does not name a type
/usr/lib/gcc/x86_64-redhat-linux/4.1.2/…/…/…/…/include/c++/4.1.2/bits/ios_base.h:639:
error: ‘streamsize’ does not name a type
/usr/lib/gcc/x86_64-redhat-linux/4.1.2/…/…/…/…/include/c++/4.1.2/bits/ios_base.h:647:
error: ‘streamsize’ does not name a type
/usr/lib/gcc/x86_64-redhat-linux/4.1.2/…/…/…/…/include/c++/4.1.2/streambuf:58:
error: expected constructor, destructor, or type conversion before
‘__copy_streambufs’
/usr/lib/gcc/x86_64-redhat-linux/4.1.2/…/…/…/…/include/c++/4.1.2/streambuf:147:
error: ‘basic_ios’ is not a template
/usr/lib/gcc/x86_64-redhat-linux/4.1.2/…/…/…/…/include/c++/4.1.2/streambuf:148:
error: ‘basic_istream’ is not a template
/usr/lib/gcc/x86_64-redhat-linux/4.1.2/…/…/…/…/include/c++/4.1.2/streambuf:149:
error: ‘basic_ostream’ is not a template
/usr/lib/gcc/x86_64-redhat-linux/4.1.2/…/…/…/…/include/c++/4.1.2/streambuf:150:
error: ‘istreambuf_iterator’ is not a template
/usr/lib/gcc/x86_64-redhat-linux/4.1.2/…/…/…/…/include/c++/4.1.2/streambuf:151:
error: ‘ostreambuf_iterator’ is not a template
/usr/lib/gcc/x86_64-redhat-linux/4.1.2/…/…/…/…/include/c++/4.1.2/streambuf:153:
error: ‘streamsize’ does not name a type
/usr/lib/gcc/x86_64-redhat-linux/4.1.2/…/…/…/…/include/c++/4.1.2/streambuf:158:
error: expected initializer before ‘<’ token
/usr/lib/gcc/x86_64-redhat-linux/4.1.2/…/…/…/…/include/c++/4.1.2/streambuf:162:
error: expected initializer before ‘<’ token
/usr/lib/gcc/x86_64-redhat-linux/4.1.2/…/…/…/…/include/c++/4.1.2/streambuf:167:
error: expected initializer before ‘<’ token
/usr/lib/gcc/x86_64-redhat-linux/4.1.2/…/…/…/…/include/c++/4.1.2/streambuf:241:
error: ‘streamsize’ has not been declared
/usr/lib/gcc/x86_64-redhat-linux/4.1.2/…/…/…/…/include/c++/4.1.2/streambuf:267:
error: ‘streamsize’ does not name a type
/usr/lib/gcc/x86_64-redhat-linux/4.1.2/…/…/…/…/include/c++/4.1.2/streambuf:340:
error: ‘streamsize’ does not name a type
/usr/lib/gcc/x86_64-redhat-linux/4.1.2/…/…/…/…/include/c++/4.1.2/streambuf:432:
error: ‘streamsize’ does not name a type
/usr/lib/gcc/x86_64-redhat-linux/4.1.2/…/…/…/…/include/c++/4.1.2/streambuf:574:
error: ‘streamsize’ has not been declared
/usr/lib/gcc/x86_64-redhat-linux/4.1.2/…/…/…/…/include/c++/4.1.2/streambuf:631:
error: ‘streamsize’ does not name a type
/usr/lib/gcc/x86_64-redhat-linux/4.1.2/…/…/…/…/include/c++/4.1.2/streambuf:647:
error: ‘streamsize’ does not name a type
/usr/lib/gcc/x86_64-redhat-linux/4.1.2/…/…/…/…/include/c++/4.1.2/streambuf:724:
error: ‘streamsize’ does not name a type
/usr/lib/gcc/x86_64-redhat-linux/4.1.2/…/…/…/…/include/c++/4.1.2/streambuf:795:
error: expected constructor, destructor, or type conversion before
‘__copy_streambufs’
/usr/lib/gcc/x86_64-redhat-linux/4.1.2/…/…/…/…/include/c++/4.1.2/streambuf:800:
error: expected constructor, destructor, or type conversion before
‘__copy_streambufs’
/usr/lib/gcc/x86_64-redhat-linux/4.1.2/…/…/…/…/include/c++/4.1.2/bits/streambuf.tcc:49:
error: expected constructor, destructor, or type conversion before
‘basic_streambuf’
/usr/lib/gcc/x86_64-redhat-linux/4.1.2/…/…/…/…/include/c++/4.1.2/bits/streambuf.tcc:83:
error: expected constructor, destructor, or type conversion before
‘basic_streambuf’
/usr/lib/gcc/x86_64-redhat-linux/4.1.2/…/…/…/…/include/c++/4.1.2/bits/streambuf.tcc:120:
error: expected constructor, destructor, or type conversion before
‘__copy_streambufs’
/usr/lib/gcc/x86_64-redhat-linux/4.1.2/…/…/…/…/include/c++/4.1.2/bits/streambuf.tcc:140:
error: wrong number of template arguments (1, should be 2)
/usr/lib/gcc/x86_64-redhat-linux/4.1.2/…/…/…/…/include/c++/4.1.2/streambuf:122:
error: provided for ‘template<class _CharT, class _Traits> class
std::basic_streambuf’
/usr/lib/gcc/x86_64-redhat-linux/4.1.2/…/…/…/…/include/c++/4.1.2/bits/streambuf.tcc:142:
error: explicit instantiation of non-template ‘int std::streamsize’
/usr/lib/gcc/x86_64-redhat-linux/4.1.2/…/…/…/…/include/c++/4.1.2/bits/streambuf.tcc:143:
error: expected ;' before ‘__copy_streambufs’ /usr/lib/gcc/x86_64-redhat-linux/4.1.2/../../../../include/c++/4.1.2/bits/streambuf.tcc:146: error: wrong number of template arguments (1, should be 2) /usr/lib/gcc/x86_64-redhat-linux/4.1.2/../../../../include/c++/4.1.2/streambuf:122: error: provided for ‘template<class _CharT, class _Traits> class std::basic_streambuf’ /usr/lib/gcc/x86_64-redhat-linux/4.1.2/../../../../include/c++/4.1.2/bits/streambuf.tcc:148: error: explicit instantiation of non-template ‘int std::streamsize’ /usr/lib/gcc/x86_64-redhat-linux/4.1.2/../../../../include/c++/4.1.2/bits/streambuf.tcc:149: error: expected;’ before ‘__copy_streambufs’
/usr/lib/gcc/x86_64-redhat-linux/4.1.2/…/…/…/…/include/c++/4.1.2/bits/locale_facets.h:66:
error: expected ‘,’ or ‘…’ before ‘&’ token
/usr/lib/gcc/x86_64-redhat-linux/4.1.2/…/…/…/…/include/c++/4.1.2/bits/locale_facets.h:72:
error: expected ‘,’ or ‘…’ before ‘&’ token
/usr/lib/gcc/x86_64-redhat-linux/4.1.2/…/…/…/…/include/c++/4.1.2/bits/locale_facets.h:77:
error: expected ‘,’ or ‘…’ before ‘&’ token
/usr/lib/gcc/x86_64-redhat-linux/4.1.2/…/…/…/…/include/c++/4.1.2/bits/locale_facets.h:82:
error: expected ‘,’ or ‘…’ before ‘&’ token
/usr/lib/gcc/x86_64-redhat-linux/4.1.2/…/…/…/…/include/c++/4.1.2/bits/locale_facets.h:91:
error: expected ‘,’ or ‘…’ before ‘__newlen’
/usr/lib/gcc/x86_64-redhat-linux/4.1.2/…/…/…/…/include/c++/4.1.2/bits/locale_facets.h:111:
error: expected initializer before ‘<’ token
/usr/lib/gcc/x86_64-redhat-linux/4.1.2/…/…/…/…/include/c++/4.1.2/x86_64-redhat-linux/bits/ctype_base.h:51:
error: ‘_ISupper’ was not declared in this scope
/usr/lib/gcc/x86_64-redhat-linux/4.1.2/…/…/…/…/include/c++/4.1.2/x86_64-redhat-linux/bits/ctype_base.h:52:
error: ‘_ISlower’ was not declared in this scope
/usr/lib/gcc/x86_64-redhat-linux/4.1.2/…/…/…/…/include/c++/4.1.2/x86_64-redhat-linux/bits/ctype_base.h:53:
error: ‘_ISalpha’ was not declared in this scope
/usr/lib/gcc/x86_64-redhat-linux/4.1.2/…/…/…/…/include/c++/4.1.2/x86_64-redhat-linux/bits/ctype_base.h:54:
error: ‘_ISdigit’ was not declared in this scope
/usr/lib/gcc/x86_64-redhat-linux/4.1.2/…/…/…/…/include/c++/4.1.2/x86_64-redhat-linux/bits/ctype_base.h:55:
error: ‘_ISxdigit’ was not declared in this scope
/usr/lib/gcc/x86_64-redhat-linux/4.1.2/…/…/…/…/include/c++/4.1.2/x86_64-redhat-linux/bits/ctype_base.h:56:
error: ‘_ISspace’ was not declared in this scope
/usr/lib/gcc/x86_64-redhat-linux/4.1.2/…/…/…/…/include/c++/4.1.2/x86_64-redhat-linux/bits/ctype_base.h:57:
error: ‘_ISprint’ was not declared in this scope
/usr/lib/gcc/x86_64-redhat-linux/4.1.2/…/…/…/…/include/c++/4.1.2/x86_64-redhat-linux/bits/ctype_base.h:58:
error: ‘_ISalpha’ was not declared in this scope
/usr/lib/gcc/x86_64-redhat-linux/4.1.2/…/…/…/…/include/c++/4.1.2/x86_64-redhat-linux/bits/ctype_base.h:58:
error: ‘_ISdigit’ was not declared in this scope
/usr/lib/gcc/x86_64-redhat-linux/4.1.2/…/…/…/…/include/c++/4.1.2/x86_64-redhat-linux/bits/ctype_base.h:58:
error: ‘_ISpunct’ was not declared in this scope
/usr/lib/gcc/x86_64-redhat-linux/4.1.2/…/…/…/…/include/c++/4.1.2/x86_64-redhat-linux/bits/ctype_base.h:59:
error: ‘_IScntrl’ was not declared in this scope
/usr/lib/gcc/x86_64-redhat-linux/4.1.2/…/…/…/…/include/c++/4.1.2/x86_64-redhat-linux/bits/ctype_base.h:60:
error: ‘_ISpunct’ was not declared in this scope
/usr/lib/gcc/x86_64-redhat-linux/4.1.2/…/…/…/…/include/c++/4.1.2/x86_64-redhat-linux/bits/ctype_base.h:61:
error: ‘_ISalpha’ was not declared in this scope
/usr/lib/gcc/x86_64-redhat-linux/4.1.2/…/…/…/…/include/c++/4.1.2/x86_64-redhat-linux/bits/ctype_base.h:61:
error: ‘_ISdigit’ was not declared in this scope
/usr/lib/gcc/x86_64-redhat-linux/4.1.2/…/…/…/…/include/c++/4.1.2/bits/locale_facets.h:684:
error: ‘__c_locale’ does not name a type
/usr/lib/gcc/x86_64-redhat-linux/4.1.2/…/…/…/…/include/c++/4.1.2/bits/locale_facets.h:725:
error: expected )' before ‘__cloc’ /usr/lib/gcc/x86_64-redhat-linux/4.1.2/../../../../include/c++/4.1.2/bits/locale_facets.h:1222: error: ‘__c_locale’ does not name a type /usr/lib/gcc/x86_64-redhat-linux/4.1.2/../../../../include/c++/4.1.2/bits/locale_facets.h:1257: error: expected)’ before ‘__cloc’
/usr/lib/gcc/x86_64-redhat-linux/4.1.2/…/…/…/…/include/c++/4.1.2/bits/codecvt.h:282:
error: ‘__c_locale’ does not name a type
/usr/lib/gcc/x86_64-redhat-linux/4.1.2/…/…/…/…/include/c++/4.1.2/bits/codecvt.h:292:
error: expected )' before ‘__cloc’ /usr/lib/gcc/x86_64-redhat-linux/4.1.2/../../../../include/c++/4.1.2/bits/codecvt.h:333: error: ‘mbstate_t’ was not declared in this scope /usr/lib/gcc/x86_64-redhat-linux/4.1.2/../../../../include/c++/4.1.2/bits/codecvt.h:333: error: template argument 3 is invalid /usr/lib/gcc/x86_64-redhat-linux/4.1.2/../../../../include/c++/4.1.2/bits/codecvt.h:334: error: ‘mbstate_t’ was not declared in this scope /usr/lib/gcc/x86_64-redhat-linux/4.1.2/../../../../include/c++/4.1.2/bits/codecvt.h:334: error: template argument 3 is invalid /usr/lib/gcc/x86_64-redhat-linux/4.1.2/../../../../include/c++/4.1.2/bits/codecvt.h:391: error: ‘mbstate_t’ was not declared in this scope /usr/lib/gcc/x86_64-redhat-linux/4.1.2/../../../../include/c++/4.1.2/bits/codecvt.h:391: error: template argument 3 is invalid /usr/lib/gcc/x86_64-redhat-linux/4.1.2/../../../../include/c++/4.1.2/bits/codecvt.h:392: error: ‘mbstate_t’ was not declared in this scope /usr/lib/gcc/x86_64-redhat-linux/4.1.2/../../../../include/c++/4.1.2/bits/codecvt.h:392: error: template argument 3 is invalid /usr/lib/gcc/x86_64-redhat-linux/4.1.2/../../../../include/c++/4.1.2/bits/locale_facets.h:1708: error: expected)’ before ‘__cloc’
/usr/lib/gcc/x86_64-redhat-linux/4.1.2/…/…/…/…/include/c++/4.1.2/bits/locale_facets.h:1865:
error: ‘__c_locale’ has not been declared
/usr/lib/gcc/x86_64-redhat-linux/4.1.2/…/…/…/…/include/c++/4.1.2/bits/locale_facets.h:
In member function ‘std::string std::numpunct<_CharT>::grouping() const’:
/usr/lib/gcc/x86_64-redhat-linux/4.1.2/…/…/…/…/include/c++/4.1.2/bits/locale_facets.h:1767:
error: return type ‘struct std::string’ is incomplete
/usr/lib/gcc/x86_64-redhat-linux/4.1.2/…/…/…/…/include/c++/4.1.2/bits/locale_facets.h:
In member function ‘virtual std::string
std::numpunct<_CharT>::do_grouping() const’:
/usr/lib/gcc/x86_64-redhat-linux/4.1.2/…/…/…/…/include/c++/4.1.2/bits/locale_facets.h:1835:
error: return type ‘struct std::string’ is incomplete
/usr/lib/gcc/x86_64-redhat-linux/4.1.2/…/…/…/…/include/c++/4.1.2/bits/locale_facets.h:
At global scope:
/usr/lib/gcc/x86_64-redhat-linux/4.1.2/…/…/…/…/include/c++/4.1.2/bits/locale_facets.h:1876:
error: variable or field ‘_M_initialize_numpunct’ declared void
/usr/lib/gcc/x86_64-redhat-linux/4.1.2/…/…/…/…/include/c++/4.1.2/bits/locale_facets.h:1876:
error: ‘int std::numpunct::_M_initialize_numpunct’ is not a static
member of ‘class std::numpunct’
/usr/lib/gcc/x86_64-redhat-linux/4.1.2/…/…/…/…/include/c++/4.1.2/bits/locale_facets.h:1876:
error: ‘__c_locale’ was not declared in this scope
/usr/lib/gcc/x86_64-redhat-linux/4.1.2/…/…/…/…/include/c++/4.1.2/bits/locale_facets.h:1884:
error: variable or field ‘_M_initialize_numpunct’ declared void
/usr/lib/gcc/x86_64-redhat-linux/4.1.2/…/…/…/…/include/c++/4.1.2/bits/locale_facets.h:1884:
error: ‘int std::numpunct<wchar_t>::_M_initialize_numpunct’ is not a
static member of ‘class std::numpunct<wchar_t>’
/usr/lib/gcc/x86_64-redhat-linux/4.1.2/…/…/…/…/include/c++/4.1.2/bits/locale_facets.h:1884:
error: ‘__c_locale’ was not declared in this scope
/usr/lib/gcc/x86_64-redhat-linux/4.1.2/…/…/…/…/include/c++/4.1.2/bits/locale_facets.h:
In constructor ‘std::numpunct_byname<_CharT>::numpunct_byname(const
char*, size_t)’:
/usr/lib/gcc/x86_64-redhat-linux/4.1.2/…/…/…/…/include/c++/4.1.2/bits/locale_facets.h:1901:
error: ‘__c_locale’ was not declared in this scope
/usr/lib/gcc/x86_64-redhat-linux/4.1.2/…/…/…/…/include/c++/4.1.2/bits/locale_facets.h:1901:
error: expected ;' before ‘__tmp’ /usr/lib/gcc/x86_64-redhat-linux/4.1.2/../../../../include/c++/4.1.2/bits/locale_facets.h:1902: error: ‘__tmp’ was not declared in this scope /usr/lib/gcc/x86_64-redhat-linux/4.1.2/../../../../include/c++/4.1.2/bits/locale_facets.h: At global scope: /usr/lib/gcc/x86_64-redhat-linux/4.1.2/../../../../include/c++/4.1.2/bits/locale_facets.h:2415: error: ‘streamsize’ has not been declared /usr/lib/gcc/x86_64-redhat-linux/4.1.2/../../../../include/c++/4.1.2/bits/locale_facets.h:2507: error: ‘__c_locale’ does not name a type /usr/lib/gcc/x86_64-redhat-linux/4.1.2/../../../../include/c++/4.1.2/bits/locale_facets.h:2535: error: expected)’ before ‘__cloc’
/usr/lib/gcc/x86_64-redhat-linux/4.1.2/…/…/…/…/include/c++/4.1.2/bits/locale_facets.h:
In constructor ‘std::collate<_CharT>::collate(size_t)’:
/usr/lib/gcc/x86_64-redhat-linux/4.1.2/…/…/…/…/include/c++/4.1.2/bits/locale_facets.h:2522:
error: class ‘std::collate<_CharT>’ does not have any field named
‘_M_c_locale_collate’
/usr/lib/gcc/x86_64-redhat-linux/4.1.2/…/…/…/…/include/c++/4.1.2/bits/locale_facets.h:
In destructor ‘virtual std::collate<_CharT>::~collate()’:
/usr/lib/gcc/x86_64-redhat-linux/4.1.2/…/…/…/…/include/c++/4.1.2/bits/locale_facets.h:2599:
error: ‘_M_c_locale_collate’ was not declared in this scope
/usr/lib/gcc/x86_64-redhat-linux/4.1.2/…/…/…/…/include/c++/4.1.2/bits/locale_facets.h:
At global scope:
/usr/lib/gcc/x86_64-redhat-linux/4.1.2/…/…/…/…/include/c++/4.1.2/bits/locale_facets.h:2837:
error: ‘__c_locale’ does not name a type
/usr/lib/gcc/x86_64-redhat-linux/4.1.2/…/…/…/…/include/c++/4.1.2/bits/locale_facets.h:2861:
error: expected )' before ‘__cloc’ /usr/lib/gcc/x86_64-redhat-linux/4.1.2/../../../../include/c++/4.1.2/bits/locale_facets.h:2968: error: ‘__c_locale’ has not been declared /usr/lib/gcc/x86_64-redhat-linux/4.1.2/../../../../include/c++/4.1.2/bits/locale_facets.h:2977: error: variable or field ‘_M_initialize_timepunct’ declared void /usr/lib/gcc/x86_64-redhat-linux/4.1.2/../../../../include/c++/4.1.2/bits/locale_facets.h:2977: error: ‘int std::__timepunct<char>::_M_initialize_timepunct’ is not a static member of ‘class std::__timepunct<char>’ /usr/lib/gcc/x86_64-redhat-linux/4.1.2/../../../../include/c++/4.1.2/bits/locale_facets.h:2977: error: ‘__c_locale’ was not declared in this scope /usr/lib/gcc/x86_64-redhat-linux/4.1.2/../../../../include/c++/4.1.2/bits/locale_facets.h:2986: error: variable or field ‘_M_initialize_timepunct’ declared void /usr/lib/gcc/x86_64-redhat-linux/4.1.2/../../../../include/c++/4.1.2/bits/locale_facets.h:2986: error: ‘int std::__timepunct<wchar_t>::_M_initialize_timepunct’ is not a static member of ‘class std::__timepunct<wchar_t>’ /usr/lib/gcc/x86_64-redhat-linux/4.1.2/../../../../include/c++/4.1.2/bits/locale_facets.h:2986: error: ‘__c_locale’ was not declared in this scope /usr/lib/gcc/x86_64-redhat-linux/4.1.2/../../../../include/c++/4.1.2/x86_64-redhat-linux/bits/time_members.h: In constructor ‘std::__timepunct<_CharT>::__timepunct(size_t)’: /usr/lib/gcc/x86_64-redhat-linux/4.1.2/../../../../include/c++/4.1.2/x86_64-redhat-linux/bits/time_members.h:39: error: class ‘std::__timepunct<_CharT>’ does not have any field named ‘_M_c_locale_timepunct’ /usr/lib/gcc/x86_64-redhat-linux/4.1.2/../../../../include/c++/4.1.2/x86_64-redhat-linux/bits/time_members.h: In constructor ‘std::__timepunct<_CharT>::__timepunct(std::__timepunct_cache<_CharT>*, size_t)’: /usr/lib/gcc/x86_64-redhat-linux/4.1.2/../../../../include/c++/4.1.2/x86_64-redhat-linux/bits/time_members.h:45: error: class ‘std::__timepunct<_CharT>’ does not have any field named ‘_M_c_locale_timepunct’ /usr/lib/gcc/x86_64-redhat-linux/4.1.2/../../../../include/c++/4.1.2/x86_64-redhat-linux/bits/time_members.h: At global scope: /usr/lib/gcc/x86_64-redhat-linux/4.1.2/../../../../include/c++/4.1.2/x86_64-redhat-linux/bits/time_members.h:50: error: expected constructor, destructor, or type conversion before ‘(’ token /usr/lib/gcc/x86_64-redhat-linux/4.1.2/../../../../include/c++/4.1.2/x86_64-redhat-linux/bits/time_members.h: In destructor ‘virtual std::__timepunct<_CharT>::~__timepunct()’: /usr/lib/gcc/x86_64-redhat-linux/4.1.2/../../../../include/c++/4.1.2/x86_64-redhat-linux/bits/time_members.h:75: error: ‘_M_c_locale_timepunct’ was not declared in this scope /usr/lib/gcc/x86_64-redhat-linux/4.1.2/../../../../include/c++/4.1.2/bits/locale_facets.h: At global scope: /usr/lib/gcc/x86_64-redhat-linux/4.1.2/../../../../include/c++/4.1.2/bits/locale_facets.h:3624: error: expected)’ before ‘__cloc’
/usr/lib/gcc/x86_64-redhat-linux/4.1.2/…/…/…/…/include/c++/4.1.2/bits/locale_facets.h:3911:
error: ‘__c_locale’ has not been declared
/usr/lib/gcc/x86_64-redhat-linux/4.1.2/…/…/…/…/include/c++/4.1.2/bits/locale_facets.h:
In member function ‘std::string std::moneypunct<_CharT,
_Intl>::grouping() const’:
/usr/lib/gcc/x86_64-redhat-linux/4.1.2/…/…/…/…/include/c++/4.1.2/bits/locale_facets.h:3681:
error: return type ‘struct std::string’ is incomplete
/usr/lib/gcc/x86_64-redhat-linux/4.1.2/…/…/…/…/include/c++/4.1.2/bits/locale_facets.h:
In member function ‘virtual std::string std::moneypunct<_CharT,
_Intl>::do_grouping() const’:
/usr/lib/gcc/x86_64-redhat-linux/4.1.2/…/…/…/…/include/c++/4.1.2/bits/locale_facets.h:3826:
error: return type ‘struct std::string’ is incomplete
/usr/lib/gcc/x86_64-redhat-linux/4.1.2/…/…/…/…/include/c++/4.1.2/bits/locale_facets.h:
At global scope:
/usr/lib/gcc/x86_64-redhat-linux/4.1.2/…/…/…/…/include/c++/4.1.2/bits/locale_facets.h:3929:
error: variable or field ‘_M_initialize_moneypunct’ declared void
/usr/lib/gcc/x86_64-redhat-linux/4.1.2/…/…/…/…/include/c++/4.1.2/bits/locale_facets.h:3929:
error: ‘int std::moneypunct<char, true>::_M_initialize_moneypunct’ is
not a static member of ‘class std::moneypunct<char, true>’
/usr/lib/gcc/x86_64-redhat-linux/4.1.2/…/…/…/…/include/c++/4.1.2/bits/locale_facets.h:3929:
error: ‘__c_locale’ was not declared in this scope
/usr/lib/gcc/x86_64-redhat-linux/4.1.2/…/…/…/…/include/c++/4.1.2/bits/locale_facets.h:3929:
error: expected primary-expression before ‘const’
/usr/lib/gcc/x86_64-redhat-linux/4.1.2/…/…/…/…/include/c++/4.1.2/bits/locale_facets.h:3933:
error: variable or field ‘_M_initialize_moneypunct’ declared void
/usr/lib/gcc/x86_64-redhat-linux/4.1.2/…/…/…/…/include/c++/4.1.2/bits/locale_facets.h:3933:
error: ‘int std::moneypunct<char, false>::_M_initialize_moneypunct’ is
not a static member of ‘class std::moneypunct<char, false>’
/usr/lib/gcc/x86_64-redhat-linux/4.1.2/…/…/…/…/include/c++/4.1.2/bits/locale_facets.h:3933:
error: ‘__c_locale’ was not declared in this scope
/usr/lib/gcc/x86_64-redhat-linux/4.1.2/…/…/…/…/include/c++/4.1.2/bits/locale_facets.h:3933:
error: expected primary-expression before ‘const’
/usr/lib/gcc/x86_64-redhat-linux/4.1.2/…/…/…/…/include/c++/4.1.2/bits/locale_facets.h:3944:
error: variable or field ‘_M_initialize_moneypunct’ declared void
/usr/lib/gcc/x86_64-redhat-linux/4.1.2/…/…/…/…/include/c++/4.1.2/bits/locale_facets.h:3944:
error: ‘int std::moneypunct<wchar_t, true>::_M_initialize_moneypunct’ is
not a static member of ‘class std::moneypunct<wchar_t, true>’
/usr/lib/gcc/x86_64-redhat-linux/4.1.2/…/…/…/…/include/c++/4.1.2/bits/locale_facets.h:3944:
error: ‘__c_locale’ was not declared in this scope
/usr/lib/gcc/x86_64-redhat-linux/4.1.2/…/…/…/…/include/c++/4.1.2/bits/locale_facets.h:3945:
error: expected primary-expression before ‘const’
/usr/lib/gcc/x86_64-redhat-linux/4.1.2/…/…/…/…/include/c++/4.1.2/bits/locale_facets.h:3949:
error: variable or field ‘_M_initialize_moneypunct’ declared void
/usr/lib/gcc/x86_64-redhat-linux/4.1.2/…/…/…/…/include/c++/4.1.2/bits/locale_facets.h:3949:
error: ‘int std::moneypunct<wchar_t, false>::_M_initialize_moneypunct’
is not a static member of ‘class std::moneypunct<wchar_t, false>’
/usr/lib/gcc/x86_64-redhat-linux/4.1.2/…/…/…/…/include/c++/4.1.2/bits/locale_facets.h:3949:
error: ‘__c_locale’ was not declared in this scope
/usr/lib/gcc/x86_64-redhat-linux/4.1.2/…/…/…/…/include/c++/4.1.2/bits/locale_facets.h:3950:
error: expected primary-expression before ‘const’
/usr/lib/gcc/x86_64-redhat-linux/4.1.2/…/…/…/…/include/c++/4.1.2/bits/locale_facets.h:
In constructor ‘std::moneypunct_byname<_CharT,
_Intl>::moneypunct_byname(const char*, size_t)’:
/usr/lib/gcc/x86_64-redhat-linux/4.1.2/…/…/…/…/include/c++/4.1.2/bits/locale_facets.h:3969:
error: ‘__c_locale’ was not declared in this scope
/usr/lib/gcc/x86_64-redhat-linux/4.1.2/…/…/…/…/include/c++/4.1.2/bits/locale_facets.h:3969:
error: expected ;' before ‘__tmp’ /usr/lib/gcc/x86_64-redhat-linux/4.1.2/../../../../include/c++/4.1.2/bits/locale_facets.h:3970: error: ‘__tmp’ was not declared in this scope /usr/lib/gcc/x86_64-redhat-linux/4.1.2/../../../../include/c++/4.1.2/bits/locale_facets.h: At global scope: /usr/lib/gcc/x86_64-redhat-linux/4.1.2/../../../../include/c++/4.1.2/bits/locale_facets.h:4330: error: ‘__c_locale’ does not name a type /usr/lib/gcc/x86_64-redhat-linux/4.1.2/../../../../include/c++/4.1.2/bits/locale_facets.h:4359: error: expected)’ before ‘__cloc’
/usr/lib/gcc/x86_64-redhat-linux/4.1.2/…/…/…/…/include/c++/4.1.2/x86_64-redhat-linux/bits/messages_members.h:
In constructor ‘std::messages<_CharT>::messages(size_t)’:
/usr/lib/gcc/x86_64-redhat-linux/4.1.2/…/…/…/…/include/c++/4.1.2/x86_64-redhat-linux/bits/messages_members.h:39:
error: class ‘std::messages<_CharT>’ does not have any field named
‘_M_c_locale_messages’
/usr/lib/gcc/x86_64-redhat-linux/4.1.2/…/…/…/…/include/c++/4.1.2/x86_64-redhat-linux/bits/messages_members.h:
At global scope:
/usr/lib/gcc/x86_64-redhat-linux/4.1.2/…/…/…/…/include/c++/4.1.2/x86_64-redhat-linux/bits/messages_members.h:44:
error: expected constructor, destructor, or type conversion before ‘(’ token
/usr/lib/gcc/x86_64-redhat-linux/4.1.2/…/…/…/…/include/c++/4.1.2/x86_64-redhat-linux/bits/messages_members.h:
In member function ‘typename std::messages<_CharT>::catalog
std::messages<_CharT>::open(const std::basic_string<char,
std::char_traits, std::allocator >&, const std::locale&,
const char*) const’:
/usr/lib/gcc/x86_64-redhat-linux/4.1.2/…/…/…/…/include/c++/4.1.2/x86_64-redhat-linux/bits/messages_members.h:62:
error: invalid use of undefined type ‘const struct
std::basic_string<char, std::char_traits, std::allocator >’
/usr/lib/gcc/x86_64-redhat-linux/4.1.2/…/…/…/…/include/c++/4.1.2/bits/stringfwd.h:56:
error: declaration of ‘const struct std::basic_string<char,
std::char_traits, std::allocator >’
/usr/lib/gcc/x86_64-redhat-linux/4.1.2/…/…/…/…/include/c++/4.1.2/x86_64-redhat-linux/bits/messages_members.h:
In destructor ‘virtual std::messages<_CharT>::~messages()’:
/usr/lib/gcc/x86_64-redhat-linux/4.1.2/…/…/…/…/include/c++/4.1.2/x86_64-redhat-linux/bits/messages_members.h:72:
error: ‘_M_c_locale_messages’ was not declared in this scope
/usr/lib/gcc/x86_64-redhat-linux/4.1.2/…/…/…/…/include/c++/4.1.2/x86_64-redhat-linux/bits/messages_members.h:
In member function ‘virtual typename std::messages<_CharT>::catalog
std::messages<_CharT>::do_open(const std::basic_string<char,
std::char_traits, std::allocator >&, const std::locale&) const’:
/usr/lib/gcc/x86_64-redhat-linux/4.1.2/…/…/…/…/include/c++/4.1.2/x86_64-redhat-linux/bits/messages_members.h:82:
error: invalid use of undefined type ‘const struct
std::basic_string<char, std::char_traits, std::allocator >’
/usr/lib/gcc/x86_64-redhat-linux/4.1.2/…/…/…/…/include/c++/4.1.2/bits/stringfwd.h:56:
error: declaration of ‘const struct std::basic_string<char,
std::char_traits, std::allocator >’
/usr/lib/gcc/x86_64-redhat-linux/4.1.2/…/…/…/…/include/c++/4.1.2/bits/streambuf_iterator.h:
At global scope:
/usr/lib/gcc/x86_64-redhat-linux/4.1.2/…/…/…/…/include/c++/4.1.2/bits/streambuf_iterator.h:52:
error: expected template-name before ‘<’ token
/usr/lib/gcc/x86_64-redhat-linux/4.1.2/…/…/…/…/include/c++/4.1.2/bits/streambuf_iterator.h:52:
error: expected {' before ‘<’ token /usr/lib/gcc/x86_64-redhat-linux/4.1.2/../../../../include/c++/4.1.2/bits/streambuf_iterator.h:52: error: expected unqualified-id before ‘<’ token /usr/lib/gcc/x86_64-redhat-linux/4.1.2/../../../../include/c++/4.1.2/bits/streambuf_iterator.h:192: error: expected template-name before ‘<’ token /usr/lib/gcc/x86_64-redhat-linux/4.1.2/../../../../include/c++/4.1.2/bits/streambuf_iterator.h:192: error: expected{’ before ‘<’ token
/usr/lib/gcc/x86_64-redhat-linux/4.1.2/…/…/…/…/include/c++/4.1.2/bits/streambuf_iterator.h:192:
error: expected unqualified-id before ‘<’ token
/usr/lib/gcc/x86_64-redhat-linux/4.1.2/…/…/…/…/include/c++/4.1.2/bits/locale_facets.tcc:
In member function ‘_InIter std::num_get<_CharT,
_InIter>::_M_extract_float(_InIter, _InIter, std::ios_base&,
std::_Ios_Iostate&, std::string&) const’:
/usr/lib/gcc/x86_64-redhat-linux/4.1.2/…/…/…/…/include/c++/4.1.2/bits/locale_facets.tcc:342:
error: invalid use of undefined type ‘struct std::string’
/usr/lib/gcc/x86_64-redhat-linux/4.1.2/…/…/…/…/include/c++/4.1.2/bits/stringfwd.h:56:
error: declaration of ‘struct std::string’
/usr/lib/gcc/x86_64-redhat-linux/4.1.2/…/…/…/…/include/c++/4.1.2/bits/locale_facets.tcc:364:
error: invalid use of undefined type ‘struct std::basic_string<char,
std::char_traits, std::allocator >’
/usr/lib/gcc/x86_64-redhat-linux/4.1.2/…/…/…/…/include/c++/4.1.2/bits/stringfwd.h:56:
error: declaration of ‘struct std::basic_string<char,
std::char_traits, std::allocator >’
/usr/lib/gcc/x86_64-redhat-linux/4.1.2/…/…/…/…/include/c++/4.1.2/bits/locale_facets.tcc:378:
error: invalid use of undefined type ‘struct std::string’
/usr/lib/gcc/x86_64-redhat-linux/4.1.2/…/…/…/…/include/c++/4.1.2/bits/stringfwd.h:56:
error: declaration of ‘struct std::string’
/usr/lib/gcc/x86_64-redhat-linux/4.1.2/…/…/…/…/include/c++/4.1.2/bits/locale_facets.tcc:397:
error: invalid use of undefined type ‘struct std::string’
/usr/lib/gcc/x86_64-redhat-linux/4.1.2/…/…/…/…/include/c++/4.1.2/bits/stringfwd.h:56:
error: declaration of ‘struct std::string’
/usr/lib/gcc/x86_64-redhat-linux/4.1.2/…/…/…/…/include/c++/4.1.2/bits/locale_facets.tcc:433:
error: invalid use of undefined type ‘struct std::string’
/usr/lib/gcc/x86_64-redhat-linux/4.1.2/…/…/…/…/include/c++/4.1.2/bits/stringfwd.h:56:
error: declaration of ‘struct std::string’
/usr/lib/gcc/x86_64-redhat-linux/4.1.2/…/…/…/…/include/c++/4.1.2/bits/locale_facets.tcc:
In member function ‘_InIter std::num_get<_CharT,
_InIter>::_M_extract_int(_InIter, _InIter, std::ios_base&,
std::_Ios_Iostate&, _ValueT&) const’:
/usr/lib/gcc/x86_64-redhat-linux/4.1.2/…/…/…/…/include/c++/4.1.2/bits/locale_facets.tcc:566:
error: invalid use of undefined type ‘struct std::string’
/usr/lib/gcc/x86_64-redhat-linux/4.1.2/…/…/…/…/include/c++/4.1.2/bits/stringfwd.h:56:
error: declaration of ‘struct std::string’
/usr/lib/gcc/x86_64-redhat-linux/4.1.2/…/…/…/…/include/c++/4.1.2/bits/locale_facets.tcc:622:
error: invalid use of undefined type ‘struct std::string’
/usr/lib/gcc/x86_64-redhat-linux/4.1.2/…/…/…/…/include/c++/4.1.2/bits/stringfwd.h:56:
error: declaration of ‘struct std::string’
/usr/lib/gcc/x86_64-redhat-linux/4.1.2/…/…/…/…/include/c++/4.1.2/bits/locale_facets.tcc:634:
error: invalid use of undefined type ‘struct std::string’
/usr/lib/gcc/x86_64-redhat-linux/4.1.2/…/…/…/…/include/c++/4.1.2/bits/stringfwd.h:56:
error: declaration of ‘struct std::string’
/usr/lib/gcc/x86_64-redhat-linux/4.1.2/…/…/…/…/include/c++/4.1.2/bits/locale_facets.tcc:
In member function ‘virtual _InIter std::num_get<_CharT,
_InIter>::do_get(_InIter, _InIter, std::ios_base&, std::_Ios_Iostate&,
float&) const’:
/usr/lib/gcc/x86_64-redhat-linux/4.1.2/…/…/…/…/include/c++/4.1.2/bits/locale_facets.tcc:762:
error: invalid use of undefined type ‘struct std::string’
/usr/lib/gcc/x86_64-redhat-linux/4.1.2/…/…/…/…/include/c++/4.1.2/bits/stringfwd.h:56:
error: declaration of ‘struct std::string’
/usr/lib/gcc/x86_64-redhat-linux/4.1.2/…/…/…/…/include/c++/4.1.2/bits/locale_facets.tcc:764:
error: invalid use of undefined type ‘struct std::string’
/usr/lib/gcc/x86_64-redhat-linux/4.1.2/…/…/…/…/include/c++/4.1.2/bits/stringfwd.h:56:
error: declaration of ‘struct std::string’
/usr/lib/gcc/x86_64-redhat-linux/4.1.2/…/…/…/…/include/c++/4.1.2/bits/locale_facets.tcc:
In member function ‘virtual _InIter std::num_get<_CharT,
_InIter>::do_get(_InIter, _InIter, std::ios_base&, std::_Ios_Iostate&,
double&) const’:
/usr/lib/gcc/x86_64-redhat-linux/4.1.2/…/…/…/…/include/c++/4.1.2/bits/locale_facets.tcc:775:
error: invalid use of undefined type ‘struct std::string’
/usr/lib/gcc/x86_64-redhat-linux/4.1.2/…/…/…/…/include/c++/4.1.2/bits/stringfwd.h:56:
error: declaration of ‘struct std::string’
/usr/lib/gcc/x86_64-redhat-linux/4.1.2/…/…/…/…/include/c++/4.1.2/bits/locale_facets.tcc:777:
error: invalid use of undefined type ‘struct std::string’
/usr/lib/gcc/x86_64-redhat-linux/4.1.2/…/…/…/…/include/c++/4.1.2/bits/stringfwd.h:56:
error: declaration of ‘struct std::string’
/usr/lib/gcc/x86_64-redhat-linux/4.1.2/…/…/…/…/include/c++/4.1.2/bits/locale_facets.tcc:
In member function ‘virtual _InIter std::num_get<_CharT,
_InIter>::do_get(_InIter, _InIter, std::ios_base&, std::_Ios_Iostate&,
long double&) const’:
/usr/lib/gcc/x86_64-redhat-linux/4.1.2/…/…/…/…/include/c++/4.1.2/bits/locale_facets.tcc:803:
error: invalid use of undefined type ‘struct std::string’
/usr/lib/gcc/x86_64-redhat-linux/4.1.2/…/…/…/…/include/c++/4.1.2/bits/stringfwd.h:56:
error: declaration of ‘struct std::string’
/usr/lib/gcc/x86_64-redhat-linux/4.1.2/…/…/…/…/include/c++/4.1.2/bits/locale_facets.tcc:805:
error: invalid use of undefined type ‘struct std::string’
/usr/lib/gcc/x86_64-redhat-linux/4.1.2/…/…/…/…/include/c++/4.1.2/bits/stringfwd.h:56:
error: declaration of ‘struct std::string’
/usr/lib/gcc/x86_64-redhat-linux/4.1.2/…/…/…/…/include/c++/4.1.2/bits/locale_facets.tcc:
At global scope:
/usr/lib/gcc/x86_64-redhat-linux/4.1.2/…/…/…/…/include/c++/4.1.2/bits/locale_facets.tcc:836:
error: ‘streamsize’ has not been declared
/usr/lib/gcc/x86_64-redhat-linux/4.1.2/…/…/…/…/include/c++/4.1.2/bits/locale_facets.tcc:
In member function ‘_OutIter std::num_put<_CharT,
_OutIter>::_M_insert_int(_OutIter, std::ios_base&, _CharT, _ValueT) const’:
/usr/lib/gcc/x86_64-redhat-linux/4.1.2/…/…/…/…/include/c++/4.1.2/bits/locale_facets.tcc:1018:
error: ‘streamsize’ does not name a type
/usr/lib/gcc/x86_64-redhat-linux/4.1.2/…/…/…/…/include/c++/4.1.2/bits/locale_facets.tcc:1019:
error: ‘__w’ was not declared in this scope
/usr/lib/gcc/x86_64-redhat-linux/4.1.2/…/…/…/…/include/c++/4.1.2/bits/locale_facets.tcc:1019:
error: expected type-specifier before ‘streamsize’
/usr/lib/gcc/x86_64-redhat-linux/4.1.2/…/…/…/…/include/c++/4.1.2/bits/locale_facets.tcc:1019:
error: expected >' before ‘streamsize’ /usr/lib/gcc/x86_64-redhat-linux/4.1.2/../../../../include/c++/4.1.2/bits/locale_facets.tcc:1019: error: expected(’ before ‘streamsize’
/usr/lib/gcc/x86_64-redhat-linux/4.1.2/…/…/…/…/include/c++/4.1.2/bits/locale_facets.tcc:1019:
error: ‘streamsize’ was not declared in this scope
/usr/lib/gcc/x86_64-redhat-linux/4.1.2/…/…/…/…/include/c++/4.1.2/bits/locale_facets.tcc:1020:
error: expected )' before ‘{’ token /usr/lib/gcc/x86_64-redhat-linux/4.1.2/../../../../include/c++/4.1.2/bits/locale_facets.tcc: In member function ‘_OutIter std::num_put<_CharT, _OutIter>::_M_insert_float(_OutIter, std::ios_base&, _CharT, char, _ValueT) const’: /usr/lib/gcc/x86_64-redhat-linux/4.1.2/../../../../include/c++/4.1.2/bits/locale_facets.tcc:1081: error: ‘streamsize’ was not declared in this scope /usr/lib/gcc/x86_64-redhat-linux/4.1.2/../../../../include/c++/4.1.2/bits/locale_facets.tcc:1081: error: expected;’ before ‘__prec’
/usr/lib/gcc/x86_64-redhat-linux/4.1.2/…/…/…/…/include/c++/4.1.2/bits/locale_facets.tcc:1082:
error: ‘__prec’ was not declared in this scope
/usr/lib/gcc/x86_64-redhat-linux/4.1.2/…/…/…/…/include/c++/4.1.2/bits/locale_facets.tcc:1082:
error: expected type-specifier before ‘streamsize’
/usr/lib/gcc/x86_64-redhat-linux/4.1.2/…/…/…/…/include/c++/4.1.2/bits/locale_facets.tcc:1082:
error: expected >' before ‘streamsize’ /usr/lib/gcc/x86_64-redhat-linux/4.1.2/../../../../include/c++/4.1.2/bits/locale_facets.tcc:1082: error: expected(’ before ‘streamsize’
/usr/lib/gcc/x86_64-redhat-linux/4.1.2/…/…/…/…/include/c++/4.1.2/bits/locale_facets.tcc:1083:
error: expected )' before ‘__prec’ /usr/lib/gcc/x86_64-redhat-linux/4.1.2/../../../../include/c++/4.1.2/bits/locale_facets.tcc:1099: error: ‘__convert_from_v’ is not a member of ‘std’ /usr/lib/gcc/x86_64-redhat-linux/4.1.2/../../../../include/c++/4.1.2/bits/locale_facets.tcc:1100: error: ‘__prec’ was not declared in this scope /usr/lib/gcc/x86_64-redhat-linux/4.1.2/../../../../include/c++/4.1.2/bits/locale_facets.tcc:1107: error: ‘__convert_from_v’ is not a member of ‘std’ /usr/lib/gcc/x86_64-redhat-linux/4.1.2/../../../../include/c++/4.1.2/bits/locale_facets.tcc:1157: error: expected;’ before ‘__off’
/usr/lib/gcc/x86_64-redhat-linux/4.1.2/…/…/…/…/include/c++/4.1.2/bits/locale_facets.tcc:1160:
error: ‘__off’ was not declared in this scope
/usr/lib/gcc/x86_64-redhat-linux/4.1.2/…/…/…/…/include/c++/4.1.2/bits/locale_facets.tcc:1166:
error: ‘__off’ was not declared in this scope
/usr/lib/gcc/x86_64-redhat-linux/4.1.2/…/…/…/…/include/c++/4.1.2/bits/locale_facets.tcc:1174:
error: ‘streamsize’ does not name a type
/usr/lib/gcc/x86_64-redhat-linux/4.1.2/…/…/…/…/include/c++/4.1.2/bits/locale_facets.tcc:1175:
error: ‘__w’ was not declared in this scope
/usr/lib/gcc/x86_64-redhat-linux/4.1.2/…/…/…/…/include/c++/4.1.2/bits/locale_facets.tcc:1175:
error: expected type-specifier before ‘streamsize’
/usr/lib/gcc/x86_64-redhat-linux/4.1.2/…/…/…/…/include/c++/4.1.2/bits/locale_facets.tcc:1175:
error: expected >' before ‘streamsize’ /usr/lib/gcc/x86_64-redhat-linux/4.1.2/../../../../include/c++/4.1.2/bits/locale_facets.tcc:1175: error: expected(’ before ‘streamsize’
/usr/lib/gcc/x86_64-redhat-linux/4.1.2/…/…/…/…/include/c++/4.1.2/bits/locale_facets.tcc:1176:
error: expected )' before ‘{’ token /usr/lib/gcc/x86_64-redhat-linux/4.1.2/../../../../include/c++/4.1.2/bits/locale_facets.tcc: In member function ‘virtual _OutIter std::num_put<_CharT, _OutIter>::do_put(_OutIter, std::ios_base&, _CharT, bool) const’: /usr/lib/gcc/x86_64-redhat-linux/4.1.2/../../../../include/c++/4.1.2/bits/locale_facets.tcc:1212: error: ‘streamsize’ does not name a type /usr/lib/gcc/x86_64-redhat-linux/4.1.2/../../../../include/c++/4.1.2/bits/locale_facets.tcc:1213: error: ‘__w’ was not declared in this scope /usr/lib/gcc/x86_64-redhat-linux/4.1.2/../../../../include/c++/4.1.2/bits/locale_facets.tcc:1213: error: expected type-specifier before ‘streamsize’ /usr/lib/gcc/x86_64-redhat-linux/4.1.2/../../../../include/c++/4.1.2/bits/locale_facets.tcc:1213: error: expected>’ before ‘streamsize’
/usr/lib/gcc/x86_64-redhat-linux/4.1.2/…/…/…/…/include/c++/4.1.2/bits/locale_facets.tcc:1213:
error: expected (' before ‘streamsize’ /usr/lib/gcc/x86_64-redhat-linux/4.1.2/../../../../include/c++/4.1.2/bits/locale_facets.tcc:1213: error: ‘streamsize’ was not declared in this scope /usr/lib/gcc/x86_64-redhat-linux/4.1.2/../../../../include/c++/4.1.2/bits/locale_facets.tcc:1214: error: expected)’ before ‘{’ token
/usr/lib/gcc/x86_64-redhat-linux/4.1.2/…/…/…/…/include/c++/4.1.2/bits/locale_facets.tcc:
In member function ‘_InIter std::money_get<_CharT,
_InIter>::_M_extract(_InIter, _InIter, std::ios_base&,
std::_Ios_Iostate&, std::string&) const’:
/usr/lib/gcc/x86_64-redhat-linux/4.1.2/…/…/…/…/include/c++/4.1.2/bits/locale_facets.tcc:1323:
error: invalid use of undefined type ‘struct std::string’
/usr/lib/gcc/x86_64-redhat-linux/4.1.2/…/…/…/…/include/c++/4.1.2/bits/stringfwd.h:56:
error: declaration of ‘struct std::string’
/usr/lib/gcc/x86_64-redhat-linux/4.1.2/…/…/…/…/include/c++/4.1.2/bits/locale_facets.tcc:1335:
error: invalid use of undefined type ‘struct std::string’
/usr/lib/gcc/x86_64-redhat-linux/4.1.2/…/…/…/…/include/c++/4.1.2/bits/stringfwd.h:56:
error: declaration of ‘struct std::string’
/usr/lib/gcc/x86_64-redhat-linux/4.1.2/…/…/…/…/include/c++/4.1.2/bits/locale_facets.tcc:1434:
error: invalid use of undefined type ‘struct std::string’
/usr/lib/gcc/x86_64-redhat-linux/4.1.2/…/…/…/…/include/c++/4.1.2/bits/stringfwd.h:56:
error: declaration of ‘struct std::string’
/usr/lib/gcc/x86_64-redhat-linux/4.1.2/…/…/…/…/include/c++/4.1.2/bits/locale_facets.tcc:1468:
error: invalid use of undefined type ‘struct std::string’
/usr/lib/gcc/x86_64-redhat-linux/4.1.2/…/…/…/…/include/c++/4.1.2/bits/stringfwd.h:56:
error: declaration of ‘struct std::string’
/usr/lib/gcc/x86_64-redhat-linux/4.1.2/…/…/…/…/include/c++/4.1.2/bits/locale_facets.tcc:1470:
error: invalid use of undefined type ‘struct std::string’
/usr/lib/gcc/x86_64-redhat-linux/4.1.2/…/…/…/…/include/c++/4.1.2/bits/stringfwd.h:56:
error: declaration of ‘struct std::string’
/usr/lib/gcc/x86_64-redhat-linux/4.1.2/…/…/…/…/include/c++/4.1.2/bits/locale_facets.tcc:1471:
error: incomplete type ‘std::string’ used in nested name specifier
/usr/lib/gcc/x86_64-redhat-linux/4.1.2/…/…/…/…/include/c++/4.1.2/bits/locale_facets.tcc:1473:
error: invalid use of undefined type ‘struct std::string’
/usr/lib/gcc/x86_64-redhat-linux/4.1.2/…/…/…/…/include/c++/4.1.2/bits/stringfwd.h:56:
error: declaration of ‘struct std::string’
/usr/lib/gcc/x86_64-redhat-linux/4.1.2/…/…/…/…/include/c++/4.1.2/bits/locale_facets.tcc:1473:
error: invalid use of undefined type ‘struct std::string’
/usr/lib/gcc/x86_64-redhat-linux/4.1.2/…/…/…/…/include/c++/4.1.2/bits/stringfwd.h:56:
error: declaration of ‘struct std::string’
/usr/lib/gcc/x86_64-redhat-linux/4.1.2/…/…/…/…/include/c++/4.1.2/bits/locale_facets.tcc:1477:
error: no match for ‘operator[]’ in ‘__res[0]’
/usr/lib/gcc/x86_64-redhat-linux/4.1.2/…/…/…/…/include/c++/4.1.2/bits/locale_facets.tcc:1478:
error: invalid use of undefined type ‘struct std::string’
/usr/lib/gcc/x86_64-redhat-linux/4.1.2/…/…/…/…/include/c++/4.1.2/bits/stringfwd.h:56:
error: declaration of ‘struct std::string’
/usr/lib/gcc/x86_64-redhat-linux/4.1.2/…/…/…/…/include/c++/4.1.2/bits/locale_facets.tcc:1478:
error: invalid use of undefined type ‘struct std::string’
/usr/lib/gcc/x86_64-redhat-linux/4.1.2/…/…/…/…/include/c++/4.1.2/bits/stringfwd.h:56:
error: declaration of ‘struct std::string’
/usr/lib/gcc/x86_64-redhat-linux/4.1.2/…/…/…/…/include/c++/4.1.2/bits/locale_facets.tcc:1481:
error: invalid use of undefined type ‘struct std::string’
/usr/lib/gcc/x86_64-redhat-linux/4.1.2/…/…/…/…/include/c++/4.1.2/bits/stringfwd.h:56:
error: declaration of ‘struct std::string’
/usr/lib/gcc/x86_64-redhat-linux/4.1.2/…/…/…/…/include/c++/4.1.2/bits/locale_facets.tcc:1502:
error: invalid use of undefined type ‘struct std::basic_string<char,
std::char_traits, std::allocator >’
/usr/lib/gcc/x86_64-redhat-linux/4.1.2/…/…/…/…/include/c++/4.1.2/bits/stringfwd.h:56:
error: declaration of ‘struct std::basic_string<char,
std::char_traits, std::allocator >’
/usr/lib/gcc/x86_64-redhat-linux/4.1.2/…/…/…/…/include/c++/4.1.2/bits/locale_facets.tcc:
In member function ‘virtual _InIter std::money_get<_CharT,
_InIter>::do_get(_InIter, _InIter, bool, std::ios_base&,
std::_Ios_Iostate&, long double&) const’:
/usr/lib/gcc/x86_64-redhat-linux/4.1.2/…/…/…/…/include/c++/4.1.2/bits/locale_facets.tcc:1538:
error: invalid use of undefined type ‘struct std::string’
/usr/lib/gcc/x86_64-redhat-linux/4.1.2/…/…/…/…/include/c++/4.1.2/bits/stringfwd.h:56:
error: declaration of ‘struct std::string’
/usr/lib/gcc/x86_64-redhat-linux/4.1.2/…/…/…/…/include/c++/4.1.2/bits/locale_facets.tcc:
In member function ‘virtual _InIter std::money_get<_CharT,
_InIter>::do_get(_InIter, _InIter, bool, std::ios_base&,
std::_Ios_Iostate&, std::basic_string<_CharT, std::char_traits<_CharT>,
std::allocator<_CharT> >&) const’:
/usr/lib/gcc/x86_64-redhat-linux/4.1.2/…/…/…/…/include/c++/4.1.2/bits/locale_facets.tcc:1548:
error: ‘size_type’ in class ‘std::string’ does not name a type
/usr/lib/gcc/x86_64-redhat-linux/4.1.2/…/…/…/…/include/c++/4.1.2/bits/locale_facets.tcc:1548:
error: invalid type in declaration before ‘;’ token
/usr/lib/gcc/x86_64-redhat-linux/4.1.2/…/…/…/…/include/c++/4.1.2/bits/locale_facets.tcc:1558:
error: invalid use of undefined type ‘struct std::string’
/usr/lib/gcc/x86_64-redhat-linux/4.1.2/…/…/…/…/include/c++/4.1.2/bits/stringfwd.h:56:
error: declaration of ‘struct std::string’
/usr/lib/gcc/x86_64-redhat-linux/4.1.2/…/…/…/…/include/c++/4.1.2/bits/locale_facets.tcc:1563:
error: invalid use of undefined type ‘struct std::string’
/usr/lib/gcc/x86_64-redhat-linux/4.1.2/…/…/…/…/include/c++/4.1.2/bits/stringfwd.h:56:
error: declaration of ‘struct std::string’
/usr/lib/gcc/x86_64-redhat-linux/4.1.2/…/…/…/…/include/c++/4.1.2/bits/locale_facets.tcc:1563:
error: invalid use of undefined type ‘struct std::string’
/usr/lib/gcc/x86_64-redhat-linux/4.1.2/…/…/…/…/include/c++/4.1.2/bits/stringfwd.h:56:
error: declaration of ‘struct std::string’
/usr/lib/gcc/x86_64-redhat-linux/4.1.2/…/…/…/…/include/c++/4.1.2/bits/locale_facets.tcc:
In member function ‘_OutIter std::money_put<_CharT,
_OutIter>::_M_insert(_OutIter, std::ios_base&, _CharT, const
std::basic_string<_CharT, std::char_traits<_CharT>,
std::allocator<_CharT> >&) const’:
/usr/lib/gcc/x86_64-redhat-linux/4.1.2/…/…/…/…/include/c++/4.1.2/bits/locale_facets.tcc:1668:
error: ‘class std::ios_base’ has no member named ‘width’
/usr/lib/gcc/x86_64-redhat-linux/4.1.2/…/…/…/…/include/c++/4.1.2/bits/locale_facets.tcc:1728:
error: ‘class std::ios_base’ has no member named ‘width’
/usr/lib/gcc/x86_64-redhat-linux/4.1.2/…/…/…/…/include/c++/4.1.2/bits/locale_facets.tcc:
In member function ‘virtual _OutIter std::money_put<_CharT,
_OutIter>::do_put(_OutIter, bool, std::ios_base&, _CharT, long double)
const’:
/usr/lib/gcc/x86_64-redhat-linux/4.1.2/…/…/…/…/include/c++/4.1.2/bits/locale_facets.tcc:1757:
error: ‘__convert_from_v’ is not a member of ‘std’
/usr/lib/gcc/x86_64-redhat-linux/4.1.2/…/…/…/…/include/c++/4.1.2/bits/locale_facets.tcc:1764:
error: ‘__convert_from_v’ is not a member of ‘std’
/usr/lib/gcc/x86_64-redhat-linux/4.1.2/…/…/…/…/include/c++/4.1.2/bits/locale_facets.tcc:
In member function ‘_InIter std::time_get<_CharT,
_InIter>::_M_extract_name(_InIter, _InIter, int&, const _CharT**,
size_t, std::ios_base&, std::_Ios_Iostate&) const’:
/usr/lib/gcc/x86_64-redhat-linux/4.1.2/…/…/…/…/include/c++/4.1.2/bits/locale_facets.tcc:2085:
error: ‘min’ is not a member of ‘std’
/usr/lib/gcc/x86_64-redhat-linux/4.1.2/…/…/…/…/include/c++/4.1.2/bits/locale_facets.tcc:
At global scope:
/usr/lib/gcc/x86_64-redhat-linux/4.1.2/…/…/…/…/include/c++/4.1.2/bits/locale_facets.tcc:2473:
error: expected ‘,’ or ‘…’ before ‘__newlen’
/usr/lib/gcc/x86_64-redhat-linux/4.1.2/…/…/…/…/include/c++/4.1.2/bits/locale_facets.tcc:
In static member function ‘static void std::__pad<_CharT,
_Traits>::_S_pad(std::ios_base&, _CharT, _CharT*, const _CharT*, int)’:
/usr/lib/gcc/x86_64-redhat-linux/4.1.2/…/…/…/…/include/c++/4.1.2/bits/locale_facets.tcc:2476:
error: ‘__newlen’ was not declared in this scope
/usr/lib/gcc/x86_64-redhat-linux/4.1.2/…/…/…/…/include/c++/4.1.2/bits/locale_facets.tcc:2476:
error: ‘__oldlen’ was not declared in this scope
/usr/lib/gcc/x86_64-redhat-linux/4.1.2/…/…/…/…/include/c++/4.1.2/bits/locale_facets.tcc:2488:
error: ‘__num’ was not declared in this scope
/usr/lib/gcc/x86_64-redhat-linux/4.1.2/…/…/…/…/include/c++/4.1.2/bits/locale_facets.tcc:
In function ‘bool std::__verify_grouping(const char*, size_t, const
std::string&)’:
/usr/lib/gcc/x86_64-redhat-linux/4.1.2/…/…/…/…/include/c++/4.1.2/bits/locale_facets.tcc:2526:
error: invalid use of undefined type ‘const struct
std::basic_string<char, std::char_traits, std::allocator >’
/usr/lib/gcc/x86_64-redhat-linux/4.1.2/…/…/…/…/include/c++/4.1.2/bits/stringfwd.h:56:
error: declaration of ‘const struct std::basic_string<char,
std::char_traits, std::allocator >’
/usr/lib/gcc/x86_64-redhat-linux/4.1.2/…/…/…/…/include/c++/4.1.2/bits/locale_facets.tcc:2527:
error: ‘min’ is not a member of ‘std’
/usr/lib/gcc/x86_64-redhat-linux/4.1.2/…/…/…/…/include/c++/4.1.2/bits/locale_facets.tcc:2535:
error: no match for ‘operator[]’ in ‘__grouping_tmp[__i]’
/usr/lib/gcc/x86_64-redhat-linux/4.1.2/…/…/…/…/include/c++/4.1.2/bits/locale_facets.tcc:2537:
error: no match for ‘operator[]’ in ‘__grouping_tmp[__i]’
/usr/lib/gcc/x86_64-redhat-linux/4.1.2/…/…/…/…/include/c++/4.1.2/bits/locale_facets.tcc:2542:
error: no match for ‘operator[]’ in ‘__grouping_tmp[0]’
/usr/lib/gcc/x86_64-redhat-linux/4.1.2/…/…/…/…/include/c++/4.1.2/bits/locale_facets.tcc:
At global scope:
/usr/lib/gcc/x86_64-redhat-linux/4.1.2/…/…/…/…/include/c++/4.1.2/bits/locale_facets.tcc:2576:
error: wrong number of template arguments (1, should be 2)
/usr/lib/gcc/x86_64-redhat-linux/4.1.2/…/…/…/…/include/c++/4.1.2/bits/locale_facets.h:3998:
error: provided for ‘template<class _CharT, class _InIter> class
std::money_get’
/usr/lib/gcc/x86_64-redhat-linux/4.1.2/…/…/…/…/include/c++/4.1.2/bits/locale_facets.tcc:2577:
error: wrong number of template arguments (1, should be 2)
/usr/lib/gcc/x86_64-redhat-linux/4.1.2/…/…/…/…/include/c++/4.1.2/bits/locale_facets.h:4147:
error: provided for ‘template<class _CharT, class _OutIter> class
std::money_put’
/usr/lib/gcc/x86_64-redhat-linux/4.1.2/…/…/…/…/include/c++/4.1.2/bits/locale_facets.tcc:2580:
error: wrong number of template arguments (1, should be 2)
/usr/lib/gcc/x86_64-redhat-linux/4.1.2/…/…/…/…/include/c++/4.1.2/bits/locale_facets.h:1927:
error: provided for ‘template<class _CharT, class _InIter> class
std::num_get’
/usr/lib/gcc/x86_64-redhat-linux/4.1.2/…/…/…/…/include/c++/4.1.2/bits/locale_facets.tcc:2581:
error: wrong number of template arguments (1, should be 2)
/usr/lib/gcc/x86_64-redhat-linux/4.1.2/…/…/…/…/include/c++/4.1.2/bits/locale_facets.h:2220:
error: provided for ‘template<class _CharT, class _OutIter> class
std::num_put’
/usr/lib/gcc/x86_64-redhat-linux/4.1.2/…/…/…/…/include/c++/4.1.2/bits/locale_facets.tcc:2583:
error: wrong number of template arguments (1, should be 2)
/usr/lib/gcc/x86_64-redhat-linux/4.1.2/…/…/…/…/include/c++/4.1.2/bits/locale_facets.h:3351:
error: provided for ‘template<class _CharT, class _OutIter> class
std::time_put’
/usr/lib/gcc/x86_64-redhat-linux/4.1.2/…/…/…/…/include/c++/4.1.2/bits/locale_facets.tcc:2584:
error: wrong number of template arguments (1, should be 2)
/usr/lib/gcc/x86_64-redhat-linux/4.1.2/…/…/…/…/include/c++/4.1.2/bits/locale_facets.h:3447:
error: provided for ‘template<class _CharT, class _OutIter> class
std::time_put_byname’
/usr/lib/gcc/x86_64-redhat-linux/4.1.2/…/…/…/…/include/c++/4.1.2/bits/locale_facets.tcc:2585:
error: wrong number of template arguments (1, should be 2)
/usr/lib/gcc/x86_64-redhat-linux/4.1.2/…/…/…/…/include/c++/4.1.2/bits/locale_facets.h:3010:
error: provided for ‘template<class _CharT, class _InIter> class
std::time_get’
/usr/lib/gcc/x86_64-redhat-linux/4.1.2/…/…/…/…/include/c++/4.1.2/bits/locale_facets.tcc:2586:
error: wrong number of template arguments (1, should be 2)
/usr/lib/gcc/x86_64-redhat-linux/4.1.2/…/…/…/…/include/c++/4.1.2/bits/locale_facets.h:3323:
error: provided for ‘template<class _CharT, class _InIter> class
std::time_get_byname’
/usr/lib/gcc/x86_64-redhat-linux/4.1.2/…/…/…/…/include/c++/4.1.2/bits/locale_facets.tcc:2590:
error: ‘mbstate_t’ was not declared in this scope
/usr/lib/gcc/x86_64-redhat-linux/4.1.2/…/…/…/…/include/c++/4.1.2/bits/locale_facets.tcc:2590:
error: template argument 3 is invalid
/usr/lib/gcc/x86_64-redhat-linux/4.1.2/…/…/…/…/include/c++/4.1.2/bits/locale_facets.tcc:2595:
error: ‘mbstate_t’ was not declared in this scope
/usr/lib/gcc/x86_64-redhat-linux/4.1.2/…/…/…/…/include/c++/4.1.2/bits/locale_facets.tcc:2595:
error: template argument 3 is invalid
/usr/lib/gcc/x86_64-redhat-linux/4.1.2/…/…/…/…/include/c++/4.1.2/bits/locale_facets.tcc:2596:
error: ‘mbstate_t’ was not declared in this scope
/usr/lib/gcc/x86_64-redhat-linux/4.1.2/…/…/…/…/include/c++/4.1.2/bits/locale_facets.tcc:2596:
error: template argument 3 is invalid
/usr/lib/gcc/x86_64-redhat-linux/4.1.2/…/…/…/…/include/c++/4.1.2/bits/locale_facets.tcc:2596:
error: template-id ‘use_facet< >’ for ‘const int&
std::use_facet(const std::locale&)’ does not match any template declaration
/usr/lib/gcc/x86_64-redhat-linux/4.1.2/…/…/…/…/include/c++/4.1.2/bits/locale_facets.tcc:2607:
error: wrong number of template arguments (1, should be 2)
/usr/lib/gcc/x86_64-redhat-linux/4.1.2/…/…/…/…/include/c++/4.1.2/bits/locale_facets.h:2220:
error: provided for ‘template<class _CharT, class _OutIter> class
std::num_put’
/usr/lib/gcc/x86_64-redhat-linux/4.1.2/…/…/…/…/include/c++/4.1.2/bits/locale_facets.tcc:2608:
error: wrong number of template arguments (1, should be 2)
/usr/lib/gcc/x86_64-redhat-linux/4.1.2/…/…/…/…/include/c++/4.1.2/bits/locale_facets.h:2220:
error: provided for ‘template<class _CharT, class _OutIter> class
std::num_put’
/usr/lib/gcc/x86_64-redhat-linux/4.1.2/…/…/…/…/include/c++/4.1.2/bits/locale_facets.tcc:2608:
error: template-id ‘use_facet< >’ for ‘const int&
std::use_facet(const std::locale&)’ does not match any template declaration
/usr/lib/gcc/x86_64-redhat-linux/4.1.2/…/…/…/…/include/c++/4.1.2/bits/locale_facets.tcc:2611:
error: wrong number of template arguments (1, should be 2)
/usr/lib/gcc/x86_64-redhat-linux/4.1.2/…/…/…/…/include/c++/4.1.2/bits/locale_facets.h:1927:
error: provided for ‘template<class _CharT, class _InIter> class
std::num_get’
/usr/lib/gcc/x86_64-redhat-linux/4.1.2/…/…/…/…/include/c++/4.1.2/bits/locale_facets.tcc:2612:
error: wrong number of template arguments (1, should be 2)
/usr/lib/gcc/x86_64-redhat-linux/4.1.2/…/…/…/…/include/c++/4.1.2/bits/locale_facets.h:1927:
error: provided for ‘template<class _CharT, class _InIter> class
std::num_get’
/usr/lib/gcc/x86_64-redhat-linux/4.1.2/…/…/…/…/include/c++/4.1.2/bits/locale_facets.tcc:2612:
error: template-id ‘use_facet< >’ for ‘const int&
std::use_facet(const std::locale&)’ does not match any template declaration
/usr/lib/gcc/x86_64-redhat-linux/4.1.2/…/…/…/…/include/c++/4.1.2/bits/locale_facets.tcc:2623:
error: wrong number of template arguments (1, should be 2)
/usr/lib/gcc/x86_64-redhat-linux/4.1.2/…/…/…/…/include/c++/4.1.2/bits/locale_facets.h:4147:
error: provided for ‘template<class _CharT, class _OutIter> class
std::money_put’
/usr/lib/gcc/x86_64-redhat-linux/4.1.2/…/…/…/…/include/c++/4.1.2/bits/locale_facets.tcc:2624:
error: wrong number of template arguments (1, should be 2)
/usr/lib/gcc/x86_64-redhat-linux/4.1.2/…/…/…/…/include/c++/4.1.2/bits/locale_facets.h:4147:
error: provided for ‘template<class _CharT, class _OutIter> class
std::money_put’
/usr/lib/gcc/x86_64-redhat-linux/4.1.2/…/…/…/…/include/c++/4.1.2/bits/locale_facets.tcc:2624:
error: template-id ‘use_facet< >’ for ‘const int&
std::use_facet(const std::locale&)’ does not match any template declaration
/usr/lib/gcc/x86_64-redhat-linux/4.1.2/…/…/…/…/include/c++/4.1.2/bits/locale_facets.tcc:2627:
error: wrong number of template arguments (1, should be 2)
/usr/lib/gcc/x86_64-redhat-linux/4.1.2/…/…/…/…/include/c++/4.1.2/bits/locale_facets.h:3998:
error: provided for ‘template<class _CharT, class _InIter> class
std::money_get’
/usr/lib/gcc/x86_64-redhat-linux/4.1.2/…/…/…/…/include/c++/4.1.2/bits/locale_facets.tcc:2628:
error: wrong number of template arguments (1, should be 2)
/usr/lib/gcc/x86_64-redhat-linux/4.1.2/…/…/…/…/include/c++/4.1.2/bits/locale_facets.h:3998:
error: provided for ‘template<class _CharT, class _InIter> class
std::money_get’
/usr/lib/gcc/x86_64-redhat-linux/4.1.2/…/…/…/…/include/c++/4.1.2/bits/locale_facets.tcc:2628:
error: template-id ‘use_facet< >’ for ‘const int&
std::use_facet(const std::locale&)’ does not match any template declaration
/usr/lib/gcc/x86_64-redhat-linux/4.1.2/…/…/…/…/include/c++/4.1.2/bits/locale_facets.tcc:2635:
error: wrong number of template arguments (1, should be 2)
/usr/lib/gcc/x86_64-redhat-linux/4.1.2/…/…/…/…/include/c++/4.1.2/bits/locale_facets.h:3351:
error: provided for ‘template<class _CharT, class _OutIter> class
std::time_put’
/usr/lib/gcc/x86_64-redhat-linux/4.1.2/…/…/…/…/include/c++/4.1.2/bits/locale_facets.tcc:2636:
error: wrong number of template arguments (1, should be 2)
/usr/lib/gcc/x86_64-redhat-linux/4.1.2/…/…/…/…/include/c++/4.1.2/bits/locale_facets.h:3351:
error: provided for ‘template<class _CharT, class _OutIter> class
std::time_put’
/usr/lib/gcc/x86_64-redhat-linux/4.1.2/…/…/…/…/include/c++/4.1.2/bits/locale_facets.tcc:2636:
error: template-id ‘use_facet< >’ for ‘const int&
std::use_facet(const std::locale&)’ does not match any template declaration
/usr/lib/gcc/x86_64-redhat-linux/4.1.2/…/…/…/…/include/c++/4.1.2/bits/locale_facets.tcc:2639:
error: wrong number of template arguments (1, should be 2)
/usr/lib/gcc/x86_64-redhat-linux/4.1.2/…/…/…/…/include/c++/4.1.2/bits/locale_facets.h:3010:
error: provided for ‘template<class _CharT, class _InIter> class
std::time_get’
/usr/lib/gcc/x86_64-redhat-linux/4.1.2/…/…/…/…/include/c++/4.1.2/bits/locale_facets.tcc:2640:
error: wrong number of template arguments (1, should be 2)
/usr/lib/gcc/x86_64-redhat-linux/4.1.2/…/…/…/…/include/c++/4.1.2/bits/locale_facets.h:3010:
error: provided for ‘template<class _CharT, class _InIter> class
std::time_get’
/usr/lib/gcc/x86_64-redhat-linux/4.1.2/…/…/…/…/include/c++/4.1.2/bits/locale_facets.tcc:2640:
error: template-id ‘use_facet< >’ for ‘const int&
std::use_facet(const std::locale&)’ does not match any template declaration
/usr/lib/gcc/x86_64-redhat-linux/4.1.2/…/…/…/…/include/c++/4.1.2/bits/locale_facets.tcc:2652:
error: ‘mbstate_t’ was not declared in this scope
/usr/lib/gcc/x86_64-redhat-linux/4.1.2/…/…/…/…/include/c++/4.1.2/bits/locale_facets.tcc:2652:
error: template argument 3 is invalid
/usr/lib/gcc/x86_64-redhat-linux/4.1.2/…/…/…/…/include/c++/4.1.2/bits/locale_facets.tcc:2652:
error: template-id ‘has_facet< >’ for ‘bool
std::has_facet(const std::locale&)’ does not match any template declaration
/usr/lib/gcc/x86_64-redhat-linux/4.1.2/…/…/…/…/include/c++/4.1.2/bits/locale_facets.tcc:2664:
error: wrong number of template arguments (1, should be 2)
/usr/lib/gcc/x86_64-redhat-linux/4.1.2/…/…/…/…/include/c++/4.1.2/bits/locale_facets.h:2220:
error: provided for ‘template<class _CharT, class _OutIter> class
std::num_put’
/usr/lib/gcc/x86_64-redhat-linux/4.1.2/…/…/…/…/include/c++/4.1.2/bits/locale_facets.tcc:2664:
error: template-id ‘has_facet< >’ for ‘bool
std::has_facet(const std::locale&)’ does not match any template declaration
/usr/lib/gcc/x86_64-redhat-linux/4.1.2/…/…/…/…/include/c++/4.1.2/bits/locale_facets.tcc:2668:
error: wrong number of template arguments (1, should be 2)
/usr/lib/gcc/x86_64-redhat-linux/4.1.2/…/…/…/…/include/c++/4.1.2/bits/locale_facets.h:1927:
error: provided for ‘template<class _CharT, class _InIter> class
std::num_get’
/usr/lib/gcc/x86_64-redhat-linux/4.1.2/…/…/…/…/include/c++/4.1.2/bits/locale_facets.tcc:2668:
error: template-id ‘has_facet< >’ for ‘bool
std::has_facet(const std::locale&)’ does not match any template declaration
/usr/lib/gcc/x86_64-redhat-linux/4.1.2/…/…/…/…/include/c++/4.1.2/bits/locale_facets.tcc:2676:
error: wrong number of template arguments (1, should be 2)
/usr/lib/gcc/x86_64-redhat-linux/4.1.2/…/…/…/…/include/c++/4.1.2/bits/locale_facets.h:4147:
error: provided for ‘template<class _CharT, class _OutIter> class
std::money_put’
/usr/lib/gcc/x86_64-redhat-linux/4.1.2/…/…/…/…/include/c++/4.1.2/bits/locale_facets.tcc:2676:
error: template-id ‘has_facet< >’ for ‘bool
std::has_facet(const std::locale&)’ does not match any template declaration
/usr/lib/gcc/x86_64-redhat-linux/4.1.2/…/…/…/…/include/c++/4.1.2/bits/locale_facets.tcc:2680:
error: wrong number of template arguments (1, should be 2)
/usr/lib/gcc/x86_64-redhat-linux/4.1.2/…/…/…/…/include/c++/4.1.2/bits/locale_facets.h:3998:
error: provided for ‘template<class _CharT, class _InIter> class
std::money_get’
/usr/lib/gcc/x86_64-redhat-linux/4.1.2/…/…/…/…/include/c++/4.1.2/bits/locale_facets.tcc:2680:
error: template-id ‘has_facet< >’ for ‘bool
std::has_facet(const std::locale&)’ does not match any template declaration
/usr/lib/gcc/x86_64-redhat-linux/4.1.2/…/…/…/…/include/c++/4.1.2/bits/locale_facets.tcc:2688:
error: wrong number of template arguments (1, should be 2)
/usr/lib/gcc/x86_64-redhat-linux/4.1.2/…/…/…/…/include/c++/4.1.2/bits/locale_facets.h:3351:
error: provided for ‘template<class _CharT, class _OutIter> class
std::time_put’
/usr/lib/gcc/x86_64-redhat-linux/4.1.2/…/…/…/…/include/c++/4.1.2/bits/locale_facets.tcc:2688:
error: template-id ‘has_facet< >’ for ‘bool
std::has_facet(const std::locale&)’ does not match any template declaration
/usr/lib/gcc/x86_64-redhat-linux/4.1.2/…/…/…/…/include/c++/4.1.2/bits/locale_facets.tcc:2692:
error: wrong number of template arguments (1, should be 2)
/usr/lib/gcc/x86_64-redhat-linux/4.1.2/…/…/…/…/include/c++/4.1.2/bits/locale_facets.h:3010:
error: provided for ‘template<class _CharT, class _InIter> class
std::time_get’
/usr/lib/gcc/x86_64-redhat-linux/4.1.2/…/…/…/…/include/c++/4.1.2/bits/locale_facets.tcc:2692:
error: template-id ‘has_facet< >’ for ‘bool
std::has_facet(const std::locale&)’ does not match any template declaration
/usr/lib/gcc/x86_64-redhat-linux/4.1.2/…/…/…/…/include/c++/4.1.2/bits/locale_facets.tcc:2703:
error: wrong number of template arguments (1, should be 2)
/usr/lib/gcc/x86_64-redhat-linux/4.1.2/…/…/…/…/include/c++/4.1.2/bits/locale_facets.h:3998:
error: provided for ‘template<class _CharT, class _InIter> class
std::money_get’
/usr/lib/gcc/x86_64-redhat-linux/4.1.2/…/…/…/…/include/c++/4.1.2/bits/locale_facets.tcc:2704:
error: wrong number of template arguments (1, should be 2)
/usr/lib/gcc/x86_64-redhat-linux/4.1.2/…/…/…/…/include/c++/4.1.2/bits/locale_facets.h:4147:
error: provided for ‘template<class _CharT, class _OutIter> class
std::money_put’
/usr/lib/gcc/x86_64-redhat-linux/4.1.2/…/…/…/…/include/c++/4.1.2/bits/locale_facets.tcc:2707:
error: wrong number of template arguments (1, should be 2)
/usr/lib/gcc/x86_64-redhat-linux/4.1.2/…/…/…/…/include/c++/4.1.2/bits/locale_facets.h:1927:
error: provided for ‘template<class _CharT, class _InIter> class
std::num_get’
/usr/lib/gcc/x86_64-redhat-linux/4.1.2/…/…/…/…/include/c++/4.1.2/bits/locale_facets.tcc:2708:
error: wrong number of template arguments (1, should be 2)
/usr/lib/gcc/x86_64-redhat-linux/4.1.2/…/…/…/…/include/c++/4.1.2/bits/locale_facets.h:2220:
error: provided for ‘template<class _CharT, class _OutIter> class
std::num_put’
/usr/lib/gcc/x86_64-redhat-linux/4.1.2/…/…/…/…/include/c++/4.1.2/bits/locale_facets.tcc:2710:
error: wrong number of template arguments (1, should be 2)
/usr/lib/gcc/x86_64-redhat-linux/4.1.2/…/…/…/…/include/c++/4.1.2/bits/locale_facets.h:3351:
error: provided for ‘template<class _CharT, class _OutIter> class
std::time_put’
/usr/lib/gcc/x86_64-redhat-linux/4.1.2/…/…/…/…/include/c++/4.1.2/bits/locale_facets.tcc:2711:
error: wrong number of template arguments (1, should be 2)
/usr/lib/gcc/x86_64-redhat-linux/4.1.2/…/…/…/…/include/c++/4.1.2/bits/locale_facets.h:3447:
error: provided for ‘template<class _CharT, class _OutIter> class
std::time_put_byname’
/usr/lib/gcc/x86_64-redhat-linux/4.1.2/…/…/…/…/include/c++/4.1.2/bits/locale_facets.tcc:2712:
error: wrong number of template arguments (1, should be 2)
/usr/lib/gcc/x86_64-redhat-linux/4.1.2/…/…/…/…/include/c++/4.1.2/bits/locale_facets.h:3010:
error: provided for ‘template<class _CharT, class _InIter> class
std::time_get’
/usr/lib/gcc/x86_64-redhat-linux/4.1.2/…/…/…/…/include/c++/4.1.2/bits/locale_facets.tcc:2713:
error: wrong number of template arguments (1, should be 2)
/usr/lib/gcc/x86_64-redhat-linux/4.1.2/…/…/…/…/include/c++/4.1.2/bits/locale_facets.h:3323:
error: provided for ‘template<class _CharT, class _InIter> class
std::time_get_byname’
/usr/lib/gcc/x86_64-redhat-linux/4.1.2/…/…/…/…/include/c++/4.1.2/bits/locale_facets.tcc:2717:
error: ‘mbstate_t’ was not declared in this scope
/usr/lib/gcc/x86_64-redhat-linux/4.1.2/…/…/…/…/include/c++/4.1.2/bits/locale_facets.tcc:2717:
error: template argument 3 is invalid
/usr/lib/gcc/x86_64-redhat-linux/4.1.2/…/…/…/…/include/c++/4.1.2/bits/locale_facets.tcc:2722:
error: ‘mbstate_t’ was not declared in this scope
/usr/lib/gcc/x86_64-redhat-linux/4.1.2/…/…/…/…/include/c++/4.1.2/bits/locale_facets.tcc:2722:
error: template argument 3 is invalid
/usr/lib/gcc/x86_64-redhat-linux/4.1.2/…/…/…/…/include/c++/4.1.2/bits/locale_facets.tcc:2723:
error: ‘mbstate_t’ was not declared in this scope
/usr/lib/gcc/x86_64-redhat-linux/4.1.2/…/…/…/…/include/c++/4.1.2/bits/locale_facets.tcc:2723:
error: template argument 3 is invalid
/usr/lib/gcc/x86_64-redhat-linux/4.1.2/…/…/…/…/include/c++/4.1.2/bits/locale_facets.tcc:2723:
error: template-id ‘use_facet< >’ for ‘const int&
std::use_facet(const std::locale&)’ does not match any template declaration
/usr/lib/gcc/x86_64-redhat-linux/4.1.2/…/…/…/…/include/c++/4.1.2/bits/locale_facets.tcc:2734:
error: wrong number of template arguments (1, should be 2)
/usr/lib/gcc/x86_64-redhat-linux/4.1.2/…/…/…/…/include/c++/4.1.2/bits/locale_facets.h:2220:
error: provided for ‘template<class _CharT, class _OutIter> class
std::num_put’
/usr/lib/gcc/x86_64-redhat-linux/4.1.2/…/…/…/…/include/c++/4.1.2/bits/locale_facets.tcc:2735:
error: wrong number of template arguments (1, should be 2)
/usr/lib/gcc/x86_64-redhat-linux/4.1.2/…/…/…/…/include/c++/4.1.2/bits/locale_facets.h:2220:
error: provided for ‘template<class _CharT, class _OutIter> class
std::num_put’
/usr/lib/gcc/x86_64-redhat-linux/4.1.2/…/…/…/…/include/c++/4.1.2/bits/locale_facets.tcc:2735:
error: template-id ‘use_facet< >’ for ‘const int&
std::use_facet(const std::locale&)’ does not match any template declaration
/usr/lib/gcc/x86_64-redhat-linux/4.1.2/…/…/…/…/include/c++/4.1.2/bits/locale_facets.tcc:2738:
error: wrong number of template arguments (1, should be 2)
/usr/lib/gcc/x86_64-redhat-linux/4.1.2/…/…/…/…/include/c++/4.1.2/bits/locale_facets.h:1927:
error: provided for ‘template<class _CharT, class _InIter> class
std::num_get’
/usr/lib/gcc/x86_64-redhat-linux/4.1.2/…/…/…/…/include/c++/4.1.2/bits/locale_facets.tcc:2739:
error: wrong number of template arguments (1, should be 2)
/usr/lib/gcc/x86_64-redhat-linux/4.1.2/…/…/…/…/include/c++/4.1.2/bits/locale_facets.h:1927:
error: provided for ‘template<class _CharT, class _InIter> class
std::num_get’
/usr/lib/gcc/x86_64-redhat-linux/4.1.2/…/…/…/…/include/c++/4.1.2/bits/locale_facets.tcc:2739:
error: template-id ‘use_facet< >’ for ‘const int&
std::use_facet(const std::locale&)’ does not match any template declaration
/usr/lib/gcc/x86_64-redhat-linux/4.1.2/…/…/…/…/include/c++/4.1.2/bits/locale_facets.tcc:2750:
error: wrong number of template arguments (1, should be 2)
/usr/lib/gcc/x86_64-redhat-linux/4.1.2/…/…/…/…/include/c++/4.1.2/bits/locale_facets.h:4147:
error: provided for ‘template<class _CharT, class _OutIter> class
std::money_put’
/usr/lib/gcc/x86_64-redhat-linux/4.1.2/…/…/…/…/include/c++/4.1.2/bits/locale_facets.tcc:2751:
error: wrong number of template arguments (1, should be 2)
/usr/lib/gcc/x86_64-redhat-linux/4.1.2/…/…/…/…/include/c++/4.1.2/bits/locale_facets.h:4147:
error: provided for ‘template<class _CharT, class _OutIter> class
std::money_put’
/usr/lib/gcc/x86_64-redhat-linux/4.1.2/…/…/…/…/include/c++/4.1.2/bits/locale_facets.tcc:2751:
error: template-id ‘use_facet< >’ for ‘const int&
std::use_facet(const std::locale&)’ does not match any template declaration
/usr/lib/gcc/x86_64-redhat-linux/4.1.2/…/…/…/…/include/c++/4.1.2/bits/locale_facets.tcc:2754:
error: wrong number of template arguments (1, should be 2)
/usr/lib/gcc/x86_64-redhat-linux/4.1.2/…/…/…/…/include/c++/4.1.2/bits/locale_facets.h:3998:
error: provided for ‘template<class _CharT, class _InIter> class
std::money_get’
/usr/lib/gcc/x86_64-redhat-linux/4.1.2/…/…/…/…/include/c++/4.1.2/bits/locale_facets.tcc:2755:
error: wrong number of template arguments (1, should be 2)
/usr/lib/gcc/x86_64-redhat-linux/4.1.2/…/…/…/…/include/c++/4.1.2/bits/locale_facets.h:3998:
error: provided for ‘template<class _CharT, class _InIter> class
std::money_get’
/usr/lib/gcc/x86_64-redhat-linux/4.1.2/…/…/…/…/include/c++/4.1.2/bits/locale_facets.tcc:2755:
error: template-id ‘use_facet< >’ for ‘const int&
std::use_facet(const std::locale&)’ does not match any template declaration
/usr/lib/gcc/x86_64-redhat-linux/4.1.2/…/…/…/…/include/c++/4.1.2/bits/locale_facets.tcc:2762:
error: wrong number of template arguments (1, should be 2)
/usr/lib/gcc/x86_64-redhat-linux/4.1.2/…/…/…/…/include/c++/4.1.2/bits/locale_facets.h:3351:
error: provided for ‘template<class _CharT, class _OutIter> class
std::time_put’
/usr/lib/gcc/x86_64-redhat-linux/4.1.2/…/…/…/…/include/c++/4.1.2/bits/locale_facets.tcc:2763:
error: wrong number of template arguments (1, should be 2)
/usr/lib/gcc/x86_64-redhat-linux/4.1.2/…/…/…/…/include/c++/4.1.2/bits/locale_facets.h:3351:
error: provided for ‘template<class _CharT, class _OutIter> class
std::time_put’
/usr/lib/gcc/x86_64-redhat-linux/4.1.2/…/…/…/…/include/c++/4.1.2/bits/locale_facets.tcc:2763:
error: template-id ‘use_facet< >’ for ‘const int&
std::use_facet(const std::locale&)’ does not match any template declaration
/usr/lib/gcc/x86_64-redhat-linux/4.1.2/…/…/…/…/include/c++/4.1.2/bits/locale_facets.tcc:2766:
error: wrong number of template arguments (1, should be 2)
/usr/lib/gcc/x86_64-redhat-linux/4.1.2/…/…/…/…/include/c++/4.1.2/bits/locale_facets.h:3010:
error: provided for ‘template<class _CharT, class _InIter> class
std::time_get’
/usr/lib/gcc/x86_64-redhat-linux/4.1.2/…/…/…/…/include/c++/4.1.2/bits/locale_facets.tcc:2767:
error: wrong number of template arguments (1, should be 2)
/usr/lib/gcc/x86_64-redhat-linux/4.1.2/…/…/…/…/include/c++/4.1.2/bits/locale_facets.h:3010:
error: provided for ‘template<class _CharT, class _InIter> class
std::time_get’
/usr/lib/gcc/x86_64-redhat-linux/4.1.2/…/…/…/…/include/c++/4.1.2/bits/locale_facets.tcc:2767:
error: template-id ‘use_facet< >’ for ‘const int&
std::use_facet(const std::locale&)’ does not match any template declaration
/usr/lib/gcc/x86_64-redhat-linux/4.1.2/…/…/…/…/include/c++/4.1.2/bits/locale_facets.tcc:2779:
error: ‘mbstate_t’ was not declared in this scope
/usr/lib/gcc/x86_64-redhat-linux/4.1.2/…/…/…/…/include/c++/4.1.2/bits/locale_facets.tcc:2779:
error: template argument 3 is invalid
/usr/lib/gcc/x86_64-redhat-linux/4.1.2/…/…/…/…/include/c++/4.1.2/bits/locale_facets.tcc:2779:
error: template-id ‘has_facet< >’ for ‘bool
std::has_facet(const std::locale&)’ does not match any template declaration
/usr/lib/gcc/x86_64-redhat-linux/4.1.2/…/…/…/…/include/c++/4.1.2/bits/locale_facets.tcc:2791:
error: wrong number of template arguments (1, should be 2)
/usr/lib/gcc/x86_64-redhat-linux/4.1.2/…/…/…/…/include/c++/4.1.2/bits/locale_facets.h:2220:
error: provided for ‘template<class _CharT, class _OutIter> class
std::num_put’
/usr/lib/gcc/x86_64-redhat-linux/4.1.2/…/…/…/…/include/c++/4.1.2/bits/locale_facets.tcc:2791:
error: template-id ‘has_facet< >’ for ‘bool
std::has_facet(const std::locale&)’ does not match any template declaration
/usr/lib/gcc/x86_64-redhat-linux/4.1.2/…/…/…/…/include/c++/4.1.2/bits/locale_facets.tcc:2795:
error: wrong number of template arguments (1, should be 2)
/usr/lib/gcc/x86_64-redhat-linux/4.1.2/…/…/…/…/include/c++/4.1.2/bits/locale_facets.h:1927:
error: provided for ‘template<class _CharT, class _InIter> class
std::num_get’
/usr/lib/gcc/x86_64-redhat-linux/4.1.2/…/…/…/…/include/c++/4.1.2/bits/locale_facets.tcc:2795:
error: template-id ‘has_facet< >’ for ‘bool
std::has_facet(const std::locale&)’ does not match any template declaration
/usr/lib/gcc/x86_64-redhat-linux/4.1.2/…/…/…/…/include/c++/4.1.2/bits/locale_facets.tcc:2803:
error: wrong number of template arguments (1, should be 2)
/usr/lib/gcc/x86_64-redhat-linux/4.1.2/…/…/…/…/include/c++/4.1.2/bits/locale_facets.h:4147:
error: provided for ‘template<class _CharT, class _OutIter> class
std::money_put’
/usr/lib/gcc/x86_64-redhat-linux/4.1.2/…/…/…/…/include/c++/4.1.2/bits/locale_facets.tcc:2803:
error: template-id ‘has_facet< >’ for ‘bool
std::has_facet(const std::locale&)’ does not match any template declaration
/usr/lib/gcc/x86_64-redhat-linux/4.1.2/…/…/…/…/include/c++/4.1.2/bits/locale_facets.tcc:2807:
error: wrong number of template arguments (1, should be 2)
/usr/lib/gcc/x86_64-redhat-linux/4.1.2/…/…/…/…/include/c++/4.1.2/bits/locale_facets.h:3998:
error: provided for ‘template<class _CharT, class _InIter> class
std::money_get’
/usr/lib/gcc/x86_64-redhat-linux/4.1.2/…/…/…/…/include/c++/4.1.2/bits/locale_facets.tcc:2807:
error: template-id ‘has_facet< >’ for ‘bool
std::has_facet(const std::locale&)’ does not match any template declaration
/usr/lib/gcc/x86_64-redhat-linux/4.1.2/…/…/…/…/include/c++/4.1.2/bits/locale_facets.tcc:2815:
error: wrong number of template arguments (1, should be 2)
/usr/lib/gcc/x86_64-redhat-linux/4.1.2/…/…/…/…/include/c++/4.1.2/bits/locale_facets.h:3351:
error: provided for ‘template<class _CharT, class _OutIter> class
std::time_put’
/usr/lib/gcc/x86_64-redhat-linux/4.1.2/…/…/…/…/include/c++/4.1.2/bits/locale_facets.tcc:2815:
error: template-id ‘has_facet< >’ for ‘bool
std::has_facet(const std::locale&)’ does not match any template declaration
/usr/lib/gcc/x86_64-redhat-linux/4.1.2/…/…/…/…/include/c++/4.1.2/bits/locale_facets.tcc:2819:
error: wrong number of template arguments (1, should be 2)
/usr/lib/gcc/x86_64-redhat-linux/4.1.2/…/…/…/…/include/c++/4.1.2/bits/locale_facets.h:3010:
error: provided for ‘template<class _CharT, class _InIter> class
std::time_get’
/usr/lib/gcc/x86_64-redhat-linux/4.1.2/…/…/…/…/include/c++/4.1.2/bits/locale_facets.tcc:2819:
error: template-id ‘has_facet< >’ for ‘bool
std::has_facet(const std::locale&)’ does not match any template declaration
/usr/lib/gcc/x86_64-redhat-linux/4.1.2/…/…/…/…/include/c++/4.1.2/clocale:58:
error: ‘::lconv’ has not been declared
/usr/lib/gcc/x86_64-redhat-linux/4.1.2/…/…/…/…/include/c++/4.1.2/clocale:59:
error: ‘::setlocale’ has not been declared
/usr/lib/gcc/x86_64-redhat-linux/4.1.2/…/…/…/…/include/c++/4.1.2/clocale:60:
error: ‘::localeconv’ has not been declared
/usr/lib/gcc/x86_64-redhat-linux/4.1.2/…/…/…/…/include/c++/4.1.2/x86_64-redhat-linux/bits/c++locale.h:55:
error: ‘uselocale’ was not declared in this scope
/usr/lib/gcc/x86_64-redhat-linux/4.1.2/…/…/…/…/include/c++/4.1.2/x86_64-redhat-linux/bits/c++locale.h:55:
error: invalid type in declaration before ‘;’ token
/usr/lib/gcc/x86_64-redhat-linux/4.1.2/…/…/…/…/include/c++/4.1.2/x86_64-redhat-linux/bits/c++locale.h:
In function ‘int std::__convert_from_v(char*, int, const char*, _Tv,
__locale_struct* const&, int)’:
/usr/lib/gcc/x86_64-redhat-linux/4.1.2/…/…/…/…/include/c++/4.1.2/x86_64-redhat-linux/bits/c++locale.h:75:
error: ‘__gnu_cxx::__uselocale’ cannot be used as a function
/usr/lib/gcc/x86_64-redhat-linux/4.1.2/…/…/…/…/include/c++/4.1.2/x86_64-redhat-linux/bits/c++locale.h:92:
error: ‘__gnu_cxx::__uselocale’ cannot be used as a function
/usr/lib/gcc/x86_64-redhat-linux/4.1.2/…/…/…/…/include/c++/4.1.2/streambuf:
At global scope:
/usr/lib/gcc/x86_64-redhat-linux/4.1.2/…/…/…/…/include/c++/4.1.2/streambuf:
In instantiation of ‘std::basic_streambuf<char, std::char_traits >’:
/usr/lib/gcc/x86_64-redhat-linux/4.1.2/…/…/…/…/include/c++/4.1.2/iosfwd:71:
instantiated from ‘std::basic_stringbuf<char, std::char_traits,
std::allocator >’
/usr/lib/gcc/x86_64-redhat-linux/4.1.2/…/…/…/…/include/c++/4.1.2/bits/sstream.tcc:256:
instantiated from here
/usr/lib/gcc/x86_64-redhat-linux/4.1.2/…/…/…/…/include/c++/4.1.2/streambuf:144:
error: template argument required for ‘struct basic_ios’
/usr/lib/gcc/x86_64-redhat-linux/4.1.2/…/…/…/…/include/c++/4.1.2/streambuf:144:
error: template argument required for ‘struct basic_istream’
/usr/lib/gcc/x86_64-redhat-linux/4.1.2/…/…/…/…/include/c++/4.1.2/streambuf:144:
error: template argument required for ‘struct basic_ostream’
/usr/lib/gcc/x86_64-redhat-linux/4.1.2/…/…/…/…/include/c++/4.1.2/streambuf:144:
error: template argument required for ‘struct istreambuf_iterator’
/usr/lib/gcc/x86_64-redhat-linux/4.1.2/…/…/…/…/include/c++/4.1.2/streambuf:144:
error: template argument required for ‘struct ostreambuf_iterator’
/usr/lib/gcc/x86_64-redhat-linux/4.1.2/…/…/…/…/include/c++/4.1.2/streambuf:
In instantiation of ‘std::basic_streambuf<wchar_t,
std::char_traits<wchar_t> >’:
/usr/lib/gcc/x86_64-redhat-linux/4.1.2/…/…/…/…/include/c++/4.1.2/iosfwd:71:
instantiated from ‘std::basic_stringbuf<wchar_t,
std::char_traits<wchar_t>, std::allocator<wchar_t> >’
/usr/lib/gcc/x86_64-redhat-linux/4.1.2/…/…/…/…/include/c++/4.1.2/bits/sstream.tcc:262:
instantiated from here
/usr/lib/gcc/x86_64-redhat-linux/4.1.2/…/…/…/…/include/c++/4.1.2/streambuf:144:
error: template argument required for ‘struct basic_ios’
/usr/lib/gcc/x86_64-redhat-linux/4.1.2/…/…/…/…/include/c++/4.1.2/streambuf:144:
error: template argument required for ‘struct basic_istream’
/usr/lib/gcc/x86_64-redhat-linux/4.1.2/…/…/…/…/include/c++/4.1.2/streambuf:144:
error: template argument required for ‘struct basic_ostream’
/usr/lib/gcc/x86_64-redhat-linux/4.1.2/…/…/…/…/include/c++/4.1.2/streambuf:144:
error: template argument required for ‘struct istreambuf_iterator’
/usr/lib/gcc/x86_64-redhat-linux/4.1.2/…/…/…/…/include/c++/4.1.2/streambuf:144:
error: template argument required for ‘struct ostreambuf_iterator’
/software/eigen-2.0.12/include/eigen2/Eigen/src/Core/IO.h: In function
‘std::ostream& Eigen::ei_print_matrix(std::ostream&, const Derived&,
const Eigen::IOFormat&)’:
/software/eigen-2.0.12/include/eigen2/Eigen/src/Core/IO.h:137: error:
‘struct std::stringstream’ has no member named ‘precision’
/software/eigen-2.0.12/include/eigen2/Eigen/src/Core/IO.h:142: error:
‘struct std::basic_ostream<char, std::char_traits >’ has no member
named ‘precision’
/software/eigen-2.0.12/include/eigen2/Eigen/src/Core/IO.h:149: error:
‘struct std::basic_ostream<char, std::char_traits >’ has no member
named ‘width’
/software/eigen-2.0.12/include/eigen2/Eigen/src/Core/IO.h:154: error:
‘struct std::basic_ostream<char, std::char_traits >’ has no member
named ‘width’
/usr/include/python2.4/object.h: At global scope:
/usr/include/python2.4/object.h:343: error: expected unqualified-id
before ‘;’ token
/usr/include/python2.4/object.h:343: error: abstract declarator
‘PyObject*’ used as declaration
make[2]: ***
[libavogadro/src/CMakeFiles/avogadro.dir/pythonextension_p.cpp.o] Error 1
make[1]: *** [libavogadro/src/CMakeFiles/avogadro.dir/all] Error 2
make: *** [all] Error 2
####################################################

What do I still miss or what is missconfigured in my installation procedure?

/usr/lib/gcc/x86_64-redhat-linux/4.1.2/…/…/…/…/include/c++/4.1.2/bits/localefwd.h:124:
error: ‘mbstate_t’ was not declared in this scope
/usr/lib/gcc/x86_64-redhat-linux/4.1.2/…/…/…/…/include/c++/4.1.2/bits/localefwd.h:124:
error: template argument 3 is invalid

I haven’t used Linux in ages, but no one else has stepped forward to address your question. From the compiler errors, it’s clear there’s something deeply wrong with your -dev packages. Either you don’t have the libstdc++ headers installed or something else is happening.

Have you compiled other C++ packages successfully?

We’ve also had some issues with GCC 4.1 – from another thread, Marcus (a Gentoo maintainer) said:

If at all possible I would rebuild with a later version of GCC. It was a
frustrating bug to try and figure out, and I still suspect something not
quite right in either OpenBabel or the way the autoopt tool initializes
the force fields.

Hope that helps,
-Geoff

Nope… it’s the first c++ code I tried to compile on my wks.

But it’s kinda weird that redhat enterprise 5 comes with a so
buggy compiler set up… anyway… I’ll bootstrap a new gcc
from scratch and let you know asap.

Thanks!

–Matt.

Geoffrey Hutchison wrote:

What do I still miss or what is missconfigured in my installation procedure?

/usr/lib/gcc/x86_64-redhat-linux/4.1.2/…/…/…/…/include/c++/4.1.2/bits/localefwd.h:124:
error: ‘mbstate_t’ was not declared in this scope
/usr/lib/gcc/x86_64-redhat-linux/4.1.2/…/…/…/…/include/c++/4.1.2/bits/localefwd.h:124:
error: template argument 3 is invalid

I haven’t used Linux in ages, but no one else has stepped forward to address your question. From the compiler errors, it’s clear there’s something deeply wrong with your -dev packages. Either you don’t have the libstdc++ headers installed or something else is happening.

Have you compiled other C++ packages successfully?

We’ve also had some issues with GCC 4.1 – from another thread, Marcus (a Gentoo maintainer) said:

If at all possible I would rebuild with a later version of GCC. It was a
frustrating bug to try and figure out, and I still suspect something not
quite right in either OpenBabel or the way the autoopt tool initializes
the force fields.

Hope that helps,
-Geoff

Compiling Avogadro on RHEL5/CentOS5 is definetely non-trivial, but it can be
done using gcc44, which is easily installed with “yum install gcc44”.

Best, Magnus

On 22 February 2010 16:24, Matteo Guglielmi matteo.guglielmi@epfl.chwrote:

Nope… it’s the first c++ code I tried to compile on my wks.

But it’s kinda weird that redhat enterprise 5 comes with a so
buggy compiler set up… anyway… I’ll bootstrap a new gcc
from scratch and let you know asap.

Thanks!

–Matt.

Geoffrey Hutchison wrote:

What do I still miss or what is missconfigured in my installation procedure?

/usr/lib/gcc/x86_64-redhat-linux/4.1.2/…/…/…/…/include/c++/4.1.2/bits/localefwd.h:124:
error: ‘mbstate_t’ was not declared in this scope
/usr/lib/gcc/x86_64-redhat-linux/4.1.2/…/…/…/…/include/c++/4.1.2/bits/localefwd.h:124:
error: template argument 3 is invalid

I haven’t used Linux in ages, but no one else has stepped forward to address your question. From the compiler errors, it’s clear there’s something deeply wrong with your -dev packages. Either you don’t have the libstdc++ headers installed or something else is happening.

Have you compiled other C++ packages successfully?

We’ve also had some issues with GCC 4.1 – from another thread, Marcus (a Gentoo maintainer) said:

If at all possible I would rebuild with a later version of GCC. It was a
frustrating bug to try and figure out, and I still suspect something not
quite right in either OpenBabel or the way the autoopt tool initializes
the force fields.

Hope that helps,
-Geoff


Download Intel® Parallel Studio Eval
Try the new software tools for yourself. Speed compiling, find bugs
proactively, and fine-tune applications for parallel performance.
See why Intel Parallel Studio got high marks during beta.
http://p.sf.net/sfu/intel-sw-dev


Avogadro-Discuss mailing list
Avogadro-Discuss@lists.sourceforge.net
https://lists.sourceforge.net/lists/listinfo/avogadro-discuss