Install fails

Bugs item #2710321, was opened at 2009-03-24 20:11
Message generated for change (Tracker Item Submitted) made by nobody
You can respond by visiting:

Please note that this message will contain a full copy of the comment thread,
including the initial issue submission, for this request,
not just the latest update.
Category: Building / Install
Group: None
Status: Open
Resolution: None
Priority: 5
Private: No
Submitted By: Nobody/Anonymous (nobody)
Assigned to: Nobody/Anonymous (nobody)
Summary: Install fails

Initial Comment:
During installation…

  1. Cmake works fine
  2. When I run make -j2, I get:


[ 63%] Built target orbitalextension
[ 65%] [ 66%] Built target povrayextension
Built target propextension
[ 68%] [ 68%] Built target supercellextension
Built target selectextension
[ 69%] Built target unitcellextension
[ 71%] [ 71%] Built target vibrationextension
Built target chargecolor
[ 71%] Built target indexcolor
[ 72%] Built target distancecolor
[ 73%] Generating avogadro_it.qm
lrelease [options] project-file
lrelease [options] ts-files [-qm qm-file]
-help Display this information and exit
Compress the .qm files
Do not include unfinished translations
Don’t explain what is being done
Display the version of lrelease and exit
make[2]: *** [avogadro/src/avogadro_it.qm] Error 1
make[1]: *** [avogadro/src/CMakeFiles/avogadro-app.dir/all] Error 2
make[1]: *** Waiting for unfinished jobs…
[ 74%] Built target residuecolor
make: *** [all] Error 2

You can respond by visiting: